program: Gaussian 09
title: 000000082
version: EM64L-G09RevD.01
frameworkgroup: C1[X(C10H13O10P)]
method: RPBEPBE
basis: SDD
operation: Freq
keyword: #p
keyword: freq=noraman
keyword: PBEPBE/SDD
title: #p freq=noraman PBEPBE/SDD
converged: YES YES NO NO
title: Mulliken charges:
elementType: P O O O O O O O O O O C C C C C C C C C C H H H H H H H H H H H H H
charge: 1.364476 -0.304170 -0.504538 -0.520271 -0.434782 -0.228711 -0.681070 -0.653009 -0.600927 -0.424795 -0.221384 -0.144045 -0.153096 -0.054196 -0.501568 0.282438 -0.329749 0.072090 0.375512 0.111552 -0.607503 0.291146 0.243896 0.262591 0.263818 0.270927 0.289944 0.407101 0.390234 0.237762 0.268767 0.432935 0.403554 0.395068
chargesum: 0.00000
title: Mulliken charges with hydrogens summed into heavy atoms:
elementType: P O O O O O O O O O O C C C C C C C C C C
charge: 1.364476 -0.304170 -0.504538 -0.113170 -0.044548 -0.228711 -0.248135 -0.249455 -0.600927 -0.029726 -0.221384 0.147102 0.090800 0.208395 0.033177 0.282438 -0.039805 0.072090 0.375512 0.111552 -0.100973
polarizability: 2.04210520e+02 1.39147901e+01 1.76722045e+02 2.77048034e+00 9.20702096e+00 1.20469336e+02
1716.lowfreq: -138.5785 0.0006 0.0008 0.0013 4.7328 7.9077 9.2910 27.9648 35.6934
frequency: -138.5781 27.8350 35.6621 40.1503 45.2429 51.8882 65.3514 68.5594 87.1906 119.4046 142.8457 149.8502 172.4133 186.9069 214.6141 241.7396 262.4627 267.3885 304.4949 324.0058 341.4873 356.3972 363.6930 368.3289 382.5668 396.9660 420.9291 457.6439 492.0392 515.2037 522.1812 563.5051 583.1435 586.1382 606.7125 608.5704 640.6136 662.1356 684.1910 687.0901 717.3648 739.7551 756.0428 773.7925 785.0639 797.3921 828.7377 839.4101 894.9621 905.8231 923.2022 928.5485 952.1113 983.5613 999.1704 1018.2269 1021.2034 1041.8386 1052.2372 1057.5731 1109.4560 1120.3208 1157.7806 1168.2218 1221.4023 1231.0387 1259.0176 1282.7239 1283.5473 1304.0677 1309.3795 1326.1889 1341.5740 1347.8152 1355.8164 1370.6992 1395.8003 1414.7073 1463.2534 1616.1068 1638.7607 1660.0037 1674.0479 2953.0213 2964.3705 2994.7154 3006.2237 3011.2605 3085.2469 3138.2098 3155.0805 3251.6857 3487.6641 3525.6658 3536.4948 3610.7446
redmass: 1.1050 8.5549 8.2205 8.6842 8.6804 7.3736 8.8267 5.6056 5.9297 5.7233 5.1967 5.8818 6.5846 7.1982 6.4810 6.5372 6.9637 7.8682 8.5271 7.1316 4.2138 4.3756 6.3310 9.3812 6.2075 3.3870 3.6989 5.5316 6.9637 4.5340 4.6292 1.1440 1.3345 2.6027 4.5586 1.2972 3.5056 6.0288 1.4901 2.9923 6.4275 6.3472 3.3865 2.1428 2.7674 2.7872 4.3424 3.3286 2.8883 1.3805 3.2036 2.6908 1.7974 3.7461 2.7978 3.1015 1.3604 2.5085 10.9770 3.5105 2.3156 1.8008 2.0023 1.2156 1.5260 1.4358 1.1923 1.3535 1.3661 1.6642 1.2696 1.7671 2.0870 1.8372 1.4874 2.1063 1.3682 1.2342 1.0879 6.4167 8.9881 8.4801 8.0456 1.0810 1.0687 1.0830 1.0827 1.0691 1.0959 1.0625 1.0920 1.1144 1.0650 1.0642 1.0644 1.0666
irintensity: 137.0691 0.5848 1.6173 0.6733 2.2185 1.0451 1.3087 2.6447 5.7736 7.0849 5.1331 4.3476 8.9868 3.3045 14.2964 1.8470 4.8058 0.8815 10.7561 4.4865 12.1491 7.0098 76.1491 22.5405 18.8088 2.3747 23.9225 8.1846 13.9113 14.4512 4.1274 88.8965 124.1922 42.4250 18.7417 83.3896 14.8135 12.8527 0.2225 41.0259 279.9583 40.9855 14.2355 79.1098 75.9908 219.9697 44.5218 20.6004 67.0058 100.1796 50.1290 8.6479 0.3420 129.4229 99.3495 52.9859 105.0244 30.0049 126.7094 557.6350 117.0449 82.1915 16.1203 22.9165 75.9464 26.3292 6.2070 4.2339 11.4046 229.9925 123.7694 3.7167 8.5132 29.0552 6.9326 41.1556 46.7415 39.1993 9.7026 273.4430 236.3346 130.3988 17.3048 15.9939 802.2764 11.3567 40.0119 22.4143 2.9420 14.8298 0.6361 2.1352 77.1885 49.7961 54.9679 102.0876
temp: 298.150 k
press: 1.00000 atm
elementType: 15 8 8 8 8 8 8 8 8 8 8 6 6 6 6 6 6 6 6 6 6 1 1 1 1 1 1 1 1 1 1 1 1 1
symmnumber: 1
zpe: 621075.2 jmol-1
zpe.correction: 0.236555 hartree
zpe.thermalcorrener: 0.257989 hartree
zpe.thermalcorrenthalpy: 0.258933 hartree
zpe.thermalcorrgfe: 0.184096 hartree
zpe.sumelectzpe: -1480.681122 hartree
zpe.sumelectthermal: -1480.659689 hartree
zpe.sumelectthermalent: -1480.658744 hartree
zpe.sumelectthermalfe: -1480.733581 hartree
dipole: 6.5794 1.3146 0.9875
dipole: 6.7817
quadrupole: -116.0484 -134.8440 -132.9810
quadrupole: 6.5753 4.1222 2.2659
quadrupole: 11.9094 -6.8862 -5.0232 6.5753 4.1222 2.2659
hfenergy: -1480.9176772 hartree
pointgroup: C01 [X(C10H13O10P1)]
dipole: -2.6483576 -0.2116306 0.2457965 debye
polarizability: 206.8083851|11.7321034|169.350168|0.2425886|-17.4230442|125.2433473 unknown
InChI: InChI=1S/C10H13O10P/c1-4(9(12)13)19-6-2-5(10(14)15)3-7(8(6)11)20-21(16,17)18/h3,6-8,11-12,14,16-17H,1-2H2
charge 0 multiplicity 1
34 atoms
P  3.862888 1.303138 0.31769
O  -1.512203 1.236088 -0.124867
O  3.074346 -0.252278 0.38254
O  0.943503 0.791651 -1.087501
O  -1.487395 -3.896286 0.09477
O  0.59258 -4.522803 0.922112
O  3.342223 1.911261 -1.181831
O  5.444713 0.728528 0.033727
O  3.633694 2.228332 1.588606
O  -4.780724 2.681043 -0.57571
O  -2.827863 2.856873 -1.830183
C  0.725479 0.698566 0.375993
C  -0.722683 0.235478 0.627874
C  1.736324 -0.290835 1.01859
C  -0.991778 -1.183252 0.090539
C  0.082892 -2.148142 0.559939
C  1.321479 -1.735853 0.949983
C  -0.191477 -3.613905 0.562752
C  -2.873637 1.410528 0.141037
C  -3.444701 2.375257 -0.855764
C  -3.60311 0.825725 1.129042
H  0.868172 1.708526 0.810624
H  -0.946086 0.306316 1.71187
H  1.849827 0.017005 2.081272
H  -0.989627 -1.14994 -1.015786
H  -1.988927 -1.541976 0.391086
H  2.07615 -2.472099 1.249427
H  0.140515 1.247158 -1.462936
H  -1.623472 -4.882029 0.0976
H  -3.181499 0.110396 1.840377
H  -4.659734 1.079468 1.223726
H  2.408939 1.542396 -1.402213
H  6.114638 1.429722 -0.165669
H  -5.119646 3.313541 -1.264318
