program: Gaussian 09
title: 000078297
version: EM64L-G09RevD.01
frameworkgroup: C1[X(C10H12N2O4S)]
method: RPBEPBE
basis: SDD
operation: Freq
keyword: #p
keyword: freq=noraman
keyword: PBEPBE/SDD
title: #p freq=noraman PBEPBE/SDD
converged: YES YES NO NO
title: Mulliken charges:
elementType: S O O O O N N C C C C C C C C C C H H H H H H H H H H H H
charge: 0.944166 -0.540770 -0.544869 -0.248651 -0.250726 -0.462374 -0.716772 -0.061823 0.499999 -0.206649 -0.227726 -0.427686 -0.324800 -0.622340 0.186346 0.287709 -0.760250 0.282449 0.281513 0.248204 0.317343 0.366598 0.277110 0.272057 0.331794 0.334685 0.254105 0.265281 0.246077
chargesum: 0.00000
title: Mulliken charges with hydrogens summed into heavy atoms:
elementType: S O O O O N N C C C C C C C C C C
charge: 0.944166 -0.540770 -0.544869 -0.248651 -0.250726 -0.095776 -0.050292 -0.061823 0.499999 0.075799 0.053787 -0.179482 -0.007457 -0.073173 0.186346 0.287709 0.005214
polarizability: 2.60747727e+02 9.41167297e+00 1.58029650e+02 -2.87829845e+00 -3.17564168e+00 9.44885865e+01
1716.lowfreq: -7.4171 -3.4042 -0.0020 -0.0016 0.0003 3.5745 20.1828 29.1402 50.3439
frequency: 20.1568 29.1051 50.3322 63.8200 70.2142 81.5591 108.2140 122.2135 133.3349 143.9543 175.3017 203.0892 243.7662 267.8234 293.6645 298.6080 325.4655 362.8488 378.0222 397.9323 415.6482 425.7564 449.3354 473.4534 533.8666 544.8861 575.4412 600.3656 618.5754 701.5412 738.4663 794.7997 808.0644 816.9222 828.3723 836.8245 870.0969 880.3847 907.2510 915.0634 932.5966 970.1024 979.7978 989.7862 1000.0570 1026.9742 1056.4196 1070.7463 1123.0465 1166.0960 1182.8081 1184.1013 1214.2200 1278.1636 1297.5670 1315.0535 1376.1992 1382.9374 1409.5992 1412.3700 1439.8251 1451.9144 1478.4687 1533.3793 1548.0294 1596.0159 1598.4262 1608.0641 1648.8564 2972.5886 2983.8082 3066.8546 3075.1541 3129.3015 3136.6285 3158.5959 3167.4590 3196.5517 3255.2634 3361.7508 3529.5248
redmass: 5.5917 4.0130 3.0984 4.2325 6.5171 3.3709 1.5859 6.0900 2.7382 1.5846 9.0486 5.7926 5.9312 2.5930 5.3763 6.1172 8.3945 5.1469 5.7484 4.6487 2.9835 9.1592 2.5104 4.0581 3.2501 3.9203 3.7300 4.6709 7.0499 5.3555 3.3790 3.1246 2.4673 1.9044 2.9868 1.7363 1.4300 2.6132 4.0679 1.2667 3.8777 1.3816 1.9303 4.8788 1.3353 1.8469 2.4011 1.4850 1.3100 1.9437 1.4253 1.1303 3.7627 2.1019 1.4613 1.8608 1.2469 5.1520 3.8520 1.1192 1.0752 1.0576 2.4758 1.0863 2.4710 6.3236 5.6882 7.2515 2.9848 1.0673 1.0392 1.0946 1.0906 1.1004 1.0899 1.0912 1.0958 1.0952 1.0817 1.0414 1.0999
irintensity: 0.4376 1.8161 3.8742 1.6055 2.5480 11.3778 34.8616 9.3689 2.1727 1.2128 1.0368 4.7980 23.1796 7.0626 9.7820 0.3745 27.9130 2.1158 3.6927 2.8636 0.1212 44.2373 2.4760 132.3705 65.4122 97.5181 10.9741 3.3858 0.9983 7.0984 0.4053 21.0668 224.8116 7.9698 15.9728 16.2634 35.2873 11.3156 61.6366 87.7031 5.9411 5.2133 12.3365 2.1395 2.0982 23.6290 47.0252 28.8169 9.6820 25.7150 2.2773 13.4007 105.1253 44.9209 51.2327 66.7739 92.5032 87.3525 36.2681 34.3948 28.2742 19.7038 52.8337 11.3972 694.8968 202.3889 19.5069 38.0204 151.6713 1.9648 0.6615 8.0197 4.7495 8.2651 5.7803 2.1879 4.8349 6.1371 447.8090 25.9213 23.2354
temp: 298.150 k
press: 1.00000 atm
elementType: 16 8 8 8 8 7 7 6 6 6 6 6 6 6 6 6 6 1 1 1 1 1 1 1 1 1 1 1 1
symmnumber: 1
zpe: 555124.9 jmol-1
zpe.correction: 0.211436 hartree
zpe.thermalcorrener: 0.229590 hartree
zpe.thermalcorrenthalpy: 0.230534 hartree
zpe.thermalcorrgfe: 0.162923 hartree
zpe.sumelectzpe: -1195.301958 hartree
zpe.sumelectthermal: -1195.283804 hartree
zpe.sumelectthermalent: -1195.282860 hartree
zpe.sumelectthermalfe: -1195.350471 hartree
dipole: 7.4338 -0.9370 3.2173
dipole: 8.1541
quadrupole: -80.5682 -117.4907 -110.1429
quadrupole: -3.3194 -17.4593 -0.0848
quadrupole: 22.1657 -14.7568 -7.4090 -3.3194 -17.4593 -0.0848
hfenergy: -1195.513394 hartree
pointgroup: C01 [X(C10H12N2O4S1)]
dipole: 2.8365395 0.7748864 -1.2827255 debye
polarizability: 261.1863346|-4.0691844|155.7698124|-6.8460532|10.482562|96.3098165 unknown
InChI: InChI=1S/C10H12N2O4S/c1-7(13)6-10(14)12-8-2-4-9(5-3-8)17(11,15)16/h2-5,12H,6,11H2,1H3
charge 0 multiplicity 1
29 atoms
S  -4.326635 -0.077523 0.290953
O  -4.742251 -1.587333 0.741413
O  -4.764869 1.26017 1.11272
O  2.356687 -2.108624 -0.684087
O  3.752417 1.889432 0.005989
N  1.706719 0.138355 -0.386891
N  -4.972805 0.160505 -1.422269
C  -2.466023 -0.035238 0.070946
C  0.302652 0.024461 -0.233716
C  -1.816366 1.207325 0.155563
C  -1.788884 -1.244726 -0.146026
C  -0.418992 1.2297 0.002568
C  -0.387968 -1.21866 -0.299576
C  4.093799 -0.410368 -0.772715
C  2.628796 -0.875154 -0.59521
C  4.549201 0.918653 -0.165322
C  6.012608 1.027132 0.210297
H  -2.384771 2.120073 0.358178
H  -2.339758 -2.190301 -0.170772
H  0.118987 2.182383 0.068524
H  0.176115 -2.137914 -0.464436
H  2.128036 1.082513 -0.288526
H  4.274547 -0.340696 -1.867617
H  4.735851 -1.236048 -0.42162
H  -5.470277 -0.703538 -1.696281
H  -5.586086 0.993036 -1.408139
H  6.202199 0.429212 1.123479
H  6.28244 2.075098 0.410085
H  6.660531 0.610774 -0.58251
