program: Gaussian 09
title: 000078288
version: EM64L-G09RevD.01
frameworkgroup: C1[X(C7H13NO4)]
method: RPBEPBE
basis: SDD
operation: Freq
keyword: #p
keyword: freq=noraman
keyword: PBEPBE/SDD
title: #p freq=noraman PBEPBE/SDD
converged: YES YES NO NO
title: Mulliken charges:
elementType: O O O O N C C C C C C C H H H H H H H H H H H H H
charge: -0.329606 -0.308390 -0.442248 -0.218245 -0.403192 0.335951 -0.710433 -0.702648 -0.710691 0.337573 -0.402679 0.187961 0.269641 0.218915 0.208751 0.227310 0.227175 0.204130 0.269823 0.208842 0.218813 0.367422 0.277079 0.275169 0.393577
chargesum: 0.00000
title: Mulliken charges with hydrogens summed into heavy atoms:
elementType: O O O O N C C C C C C C
charge: -0.329606 -0.308390 -0.048671 -0.218245 -0.035770 0.335951 -0.013126 -0.044033 -0.013213 0.337573 0.149569 0.187961
polarizability: 1.29164440e+02 1.54055287e+00 9.37139940e+01 -1.20086219e-02 -3.52407071e-02 7.02447153e+01
1716.lowfreq: -20.2070 -5.9915 -2.8731 -0.0003 0.0002 0.0006 12.2793 41.7591 65.7806
frequency: 11.8066 41.5571 65.7684 78.3385 102.0806 158.8039 177.3694 180.9222 237.9506 238.9305 252.8771 290.7948 304.5004 330.1852 401.1180 434.4779 436.0517 489.1639 532.2486 544.8345 592.1810 651.0267 698.1720 707.2611 730.2609 807.6148 847.7366 914.4994 922.7031 953.9523 981.3274 983.9927 1029.5806 1033.0677 1080.1825 1146.4642 1170.6586 1216.9322 1217.7875 1256.0391 1269.7816 1305.4599 1330.4877 1374.5532 1377.9679 1399.8942 1444.5178 1463.0420 1466.6695 1467.0100 1469.8674 1472.4105 1478.2780 1501.7823 1638.7266 1682.3360 2983.9785 2987.9101 2989.5515 2994.8560 3020.0573 3080.3774 3083.7178 3096.6001 3098.0876 3111.0324 3114.9601 3530.7655 3578.7562
redmass: 3.8177 7.1103 4.1001 5.3767 3.5982 1.9491 1.3678 4.2521 1.0378 1.0619 5.3501 4.6390 3.6752 2.5762 2.7826 2.8441 3.0268 1.8499 4.2173 3.9255 1.1063 1.4626 7.5465 11.3855 5.5959 3.5720 4.2285 1.5984 1.6319 1.2029 2.7456 3.7133 1.4181 1.4282 2.0432 4.9669 2.2595 1.7612 1.1309 3.0131 3.0319 2.3856 1.5486 1.2304 1.2310 1.2188 1.0467 1.2010 1.0568 1.0855 1.1199 1.5648 1.0514 1.0629 9.1133 9.1370 1.0603 1.0360 1.0356 1.0362 1.0990 1.0994 1.0992 1.0992 1.1004 1.1005 1.0998 1.0644 1.0780
irintensity: 0.2746 2.4206 8.3720 0.1703 0.0131 2.0242 1.3097 6.2099 0.0453 0.2224 3.6181 1.6262 12.4829 2.0010 0.0460 2.8939 5.9350 51.1860 3.1863 53.9343 45.4331 190.1272 1.9411 37.6160 14.1961 5.9105 30.1903 0.8298 1.0971 0.2496 66.0751 116.0940 0.0069 9.2113 242.4516 242.9594 181.9539 24.5559 4.3837 27.5247 19.8415 61.2126 27.4442 43.2737 41.0094 35.7351 0.8136 55.4259 1.7773 54.1802 81.9981 337.2384 4.3550 52.8107 233.2875 250.3606 34.6422 26.7111 10.0060 27.6904 6.6928 10.5278 17.9409 57.4370 31.9969 5.2235 16.7357 32.5246 82.7831
temp: 298.150 k
press: 1.00000 atm
elementType: 8 8 8 8 7 6 6 6 6 6 6 6 1 1 1 1 1 1 1 1 1 1 1 1 1
symmnumber: 1
zpe: 526743.6 jmol-1
zpe.correction: 0.200626 hartree
zpe.thermalcorrener: 0.214833 hartree
zpe.thermalcorrenthalpy: 0.215777 hartree
zpe.thermalcorrgfe: 0.157901 hartree
zpe.sumelectzpe: -629.259435 hartree
zpe.sumelectthermal: -629.245228 hartree
zpe.sumelectthermalent: -629.244284 hartree
zpe.sumelectthermalfe: -629.302160 hartree
dipole: 0.9173 3.1215 -0.0316
dipole: 3.2536
quadrupole: -69.3286 -73.5775 -70.5887
quadrupole: -7.9198 0.1494 0.1122
quadrupole: 1.8363 -2.4125 0.5762 -7.9198 0.1494 0.1122
hfenergy: -629.4600609 hartree
pointgroup: C01 [X(C7H13N1O4)]
dipole: -0.4809417 0.6857587 0.9680011 debye
dipolederiv: -1.8887139 0.1949283 0.0857856 0.4123181 -0.4824854 -0.0886804 0.4098248 -0.1195807 -0.5075808 -0.8178127 0.0194515 -0.0326079 -0.0290653 -0.5579055 -0.2893679 -0.1054428 -0.2830459 -0.8075769 -0.4052334 0.0758195 0.1098373 0.1258856 -0.6781691 -0.3621114 0.1860347 -0.3673483 -0.9410461 -1.1377339 0.1637819 0.1514377 0.0390554 -0.4186898 -0.1365354 -0.0298737 -0.1234085 -0.5077528 -1.4772989 -0.0560204 -0.2255878 -0.184601 -0.466849 -0.0234944 -0.4104492 -0.0082993 -0.5345151 1.1966556 -0.0775931 -0.0167393 0.0319277 0.4345642 -0.0599387 0.1496476 -0.0748282 0.3844862 -0.1244552 0.004159 0.0258629 -0.0550979 -0.2007705 -0.0303696 -0.0097853 -0.0008874 -0.0103112 -0.0591405 0.0395121 0.0481742 0.044727 -0.0174201 -0.0585509 0.0547072 -0.0594082 -0.0548251 -0.1174157 0.0299242 0.0292889 0.0179085 -0.0329169 0.0704141 -0.0428192 0.0508341 -0.1859545 2.4699479 -0.0541462 0.2156163 -0.1644581 0.6555669 0.4825655 0.0527069 0.4994651 1.0771168 0.4520817 -0.135382 -0.1647727 -0.3242258 0.2304249 -0.1580221 -0.4426553 -0.1329901 0.0568339 1.4741831 -0.1536672 -0.0913124 -0.0734779 0.6310965 0.6036892 0.018938 0.5947526 1.0890331 0.118673 0.0823461 0.0664251 0.0662702 0.0413276 -0.0477841 0.0569263 -0.0801654 0.0211298 0.1107242 0.0108747 -0.0463098 0.0049736 0.0251354 0.0651934 -0.025187 0.1147746 -0.1131022 -0.1802319 -0.0406579 -0.0516712 -0.0258029 0.0912496 0.0115579 -0.0545267 0.003928 0.0982717 0.0951862 -0.0777765 0.0002478 -0.0426792 -0.1430483 -0.0228107 0.0183156 0.0073245 0.0854583 0.1084253 0.0182944 -0.0384718 0.0178781 0.0491122 0.1020331 -0.0032906 0.0665643 -0.1206124 -0.1664163 0.0067226 -0.0294687 -0.0200935 0.0931945 -0.0170454 -0.0701586 -0.0130024 0.072234 0.1093768 0.0264047 0.1022345 0.0267007 0.0633155 -0.0787212 0.0882684 -0.0439404 0.0090952 -0.1739324 0.0014942 -0.080394 -0.0060018 0.0965725 0.0107775 -0.0670443 0.0175096 0.0868121 0.0978544 -0.0782117 -0.0002478 -0.0607762 -0.1434955 0.0349073 -0.0038114 -0.0163727 0.0679844 0.260657 0.0237317 0.0222062 0.066352 0.3006476 -0.0498156 0.0829087 -0.0557193 0.2671084 -0.016468 -0.0056809 0.0048432 0.0214668 0.0854663 0.0596808 0.1222948 0.0455974 -0.0031985 -0.0192152 0.0065235 -0.01403 0.1083321 -0.0454657 0.0130154 0.053299 0.0119073 0.1119835 0.0903028 -0.0248324 -0.0703464 0.0024838 0.389542 -0.0305864 -0.0288277 -0.0336606 0.3589284 unknown
polarizability: 128.8149197|-2.3647206|77.7307145|4.0196587|10.7313065|86.5775151 unknown
InChI: InChI=1S/C7H13NO4/c1-7(2,3)12-6(11)8-4-5(9)10/h8-9H,4H2,1-3H3
charge 0 multiplicity 1
25 atoms
O  -1.240244 0.322913 0.376388
O  -0.258369 -0.940559 -1.389719
O  3.119657 0.826812 1.65338
O  4.664081 -0.228034 0.270559
N  1.005518 0.062621 0.295905
C  -2.673445 0.137844 -0.106652
C  -3.028945 -1.362451 -0.090848
C  -3.467243 0.917972 0.955548
C  -2.827974 0.768141 -1.505319
C  -0.180246 -0.248418 -0.336722
C  2.270262 -0.416791 -0.248521
C  3.478816 0.044033 0.544993
H  -2.432645 -1.915714 -0.833267
H  -2.84612 -1.790961 0.910651
H  -4.100858 -1.488857 -0.329809
H  -3.154932 1.976378 0.973859
H  -3.301722 0.487517 1.958244
H  -4.546844 0.872562 0.725976
H  -2.227558 0.223158 -2.250476
H  -3.890179 0.732767 -1.809636
H  -2.509708 1.825763 -1.488786
H  1.005092 0.6303 1.143889
H  2.408348 -0.084422 -1.296445
H  2.300381 -1.524243 -0.289338
H  3.93638 1.107065 2.146949
