program: Gaussian 09
title: 000078251
version: EM64L-G09RevD.01
frameworkgroup: C1[X(C10H10N2O2)]
method: RPBEPBE
basis: SDD
operation: Freq
keyword: #p
keyword: freq=noraman
keyword: PBEPBE/SDD
title: #p freq=noraman PBEPBE/SDD
converged: NO YES NO NO
title: Mulliken charges:
elementType: O O N N C C C C C C C C C C H H H H H H H H H H
charge: -0.248022 -0.267289 -0.433974 0.011810 0.097888 0.313749 -0.110440 -0.340937 -0.372574 -0.236942 0.229151 -0.193515 -0.221581 -0.671102 0.286358 0.332676 0.238248 0.229553 0.228750 0.227935 0.227866 0.207555 0.232416 0.232420
chargesum: 0.00000
title: Mulliken charges with hydrogens summed into heavy atoms:
elementType: O O N N C C C C C C C C C C
charge: -0.248022 -0.267289 -0.101298 0.011810 0.097888 0.313749 -0.110440 -0.054579 -0.134326 -0.007388 0.229151 0.035235 0.234220 0.001289
polarizability: 1.95601848e+02 3.64680981e+00 1.34213430e+02 -5.77887325e-02 -3.22431728e-03 6.10034049e+01
1716.lowfreq: -2.6577 -1.7562 -0.0006 -0.0006 -0.0004 8.9263 30.3959 66.3577 87.0716
frequency: 30.3530 66.3566 87.0668 90.2561 151.3842 188.1424 215.6640 245.9282 290.3084 313.1314 370.0588 395.1294 428.8270 498.9794 566.5487 572.1564 588.1056 632.6888 647.3658 720.3557 759.8985 760.4884 784.3818 786.6136 798.7981 826.8070 867.0191 893.1926 956.3347 993.6906 1001.2206 1006.7755 1031.6133 1092.0897 1113.0982 1117.8410 1134.9077 1163.8666 1193.7716 1247.5508 1247.7985 1266.7814 1342.3333 1346.4389 1382.1729 1400.4929 1419.1753 1429.7745 1461.8109 1462.5065 1473.4522 1485.6056 1489.0532 1588.6205 1599.6979 1631.3561 2996.4831 3007.6509 3065.9671 3092.7345 3109.4018 3134.2190 3148.8497 3164.6156 3184.0715 3614.6281
redmass: 3.5134 3.2173 4.3428 3.4153 3.0878 5.0943 5.3954 1.2754 5.5852 5.3732 3.8390 6.1563 3.0204 6.5113 4.0863 7.4467 2.1333 6.9434 1.8719 5.0860 1.5112 5.9816 3.6895 7.3960 1.1179 4.1136 1.4363 5.7544 1.3678 1.3117 3.5708 2.1431 3.3073 5.9973 2.2209 1.6640 1.4623 1.1878 3.5448 1.8266 1.1359 2.7069 2.1260 1.4788 2.6722 1.3001 6.2755 2.0644 3.8406 1.0399 1.0823 1.3968 1.9439 6.4079 11.6263 7.4136 1.0361 1.0579 1.1067 1.0984 1.1022 1.0860 1.0910 1.0977 1.0972 1.0820
irintensity: 1.1550 2.3872 2.6637 2.1295 1.6112 3.9645 1.5828 0.9116 11.0763 0.0044 9.5484 0.8533 7.7950 0.6775 0.8385 0.1127 18.8968 2.5048 100.4399 3.0763 87.5045 8.9149 16.6544 3.6339 2.4907 1.9693 0.9672 2.3342 3.3125 0.3522 73.5875 12.9244 185.0863 241.9910 8.2104 22.4024 5.6624 40.9064 194.2187 8.8163 0.0056 15.7033 30.3434 34.0522 10.3479 46.9219 46.8378 34.2946 71.7872 11.5969 1.0054 4.4902 15.3600 14.0880 155.0112 5.8077 23.6764 21.7155 11.2336 30.9236 42.5016 2.1144 15.4053 20.9109 7.9092 84.4647
temp: 298.150 k
press: 1.00000 atm
elementType: 8 8 7 7 6 6 6 6 6 6 6 6 6 6 1 1 1 1 1 1 1 1 1 1
symmnumber: 1
zpe: 485531.1 jmol-1
zpe.correction: 0.184929 hartree
zpe.thermalcorrener: 0.197160 hartree
zpe.thermalcorrenthalpy: 0.198104 hartree
zpe.thermalcorrgfe: 0.145309 hartree
zpe.sumelectzpe: -646.007537 hartree
zpe.sumelectthermal: -645.995306 hartree
zpe.sumelectthermalent: -645.994362 hartree
zpe.sumelectthermalfe: -646.047157 hartree
dipole: -1.7457 1.8623 0.0042
dipole: 2.5526
quadrupole: -59.5666 -76.0259 -83.7412
quadrupole: -5.8444 0.0003 0.0055
quadrupole: 13.5446 -2.9147 -10.6299 -5.8444 0.0003 0.0055
hfenergy: -646.1924658 hartree
pointgroup: C01 [X(C10H10N2O2)]
dipole: -0.6788409 -0.7401061 -0.0016715 debye
dipolederiv: -2.0018785 0.1195826 0.0007192 0.3672492 -0.4363338 0.0002437 0.0036415 -0.0004057 -0.2653656 -0.7884801 -0.0875471 -0.0000523 0.00451 -0.9022046 -0.0015208 -0.0003097 0.0012009 -0.3250986 -0.6977915 -0.3964456 -0.0001493 -0.0630361 -0.3648235 0.0001111 -0.0006048 -0.0003253 -0.2320423 0.1157567 0.5502962 0.0000857 0.7422805 0.0890338 0.000567 -0.0002237 0.0004373 -0.1526564 0.0306925 -0.0834455 -0.0000544 -0.1066613 -0.1664322 -0.000063 -0.0004289 -0.0003188 0.0207856 0.120264 -0.1926144 0.0001317 -0.3998678 0.157482 -0.0003815 0.0001413 -0.0002662 0.0650895 -0.2192943 -0.1382553 0.0002355 -0.6429497 -0.3051058 -0.0002257 -0.0005792 -0.0002228 -0.0142857 0.0476599 0.0401511 0.0002999 -0.023933 0.0739767 -0.0000046 0.0003091 0.0000467 -0.1156579 0.0292213 0.1163126 0.0002576 0.077922 -0.0163181 0.000068 0.0002268 0.0001509 -0.177959 -0.169333 -0.0712764 0.0000263 -0.0821915 0.1124704 -0.0001203 0.0000661 -0.0000926 -0.1766847 2.3631086 0.1191894 0.0000059 -0.1026565 1.1526302 0.0014717 -0.0002118 -0.0000788 0.2429973 0.105998 0.0230904 0.00035 0.1152934 0.0284032 0.0001369 0.0002771 0.0000331 -0.1481235 1.0698907 0.0317541 -0.0006388 0.2072447 0.2498647 -0.0001593 -0.0012513 0.0000614 0.3563795 -0.1168409 0.0801611 0.0001936 0.050856 0.0075839 -0.000232 0.0003029 -0.0002074 0.0568621 0.1048983 -0.0736757 -0.0001239 -0.0345058 0.0369541 -0.0000505 -0.000201 -0.0000932 0.1621497 0.1396299 -0.0181345 -0.0002042 0.0318132 0.2756708 -0.0000148 -0.0001533 -0.0000266 0.3375188 0.0277071 -0.0602467 -0.000182 -0.1019557 -0.0460932 -0.000114 -0.0001299 -0.0000757 0.1790973 0.0312619 0.0852878 -0.0001589 0.0940356 -0.0755824 0.0001145 -0.0001652 0.0001158 0.1622226 -0.1347159 0.0138091 -0.0003692 0.0224529 0.0924538 0.000025 -0.0003843 0.0000223 0.1577033 -0.0684692 0.0239001 -0.028971 -0.072512 -0.0064091 0.0914613 0.0120477 0.1020044 -0.061859 -0.0684348 0.0234452 0.0287892 -0.0729641 -0.0064428 -0.091412 -0.0121606 -0.1021958 -0.0620712 -0.1550033 -0.0816729 0.0004063 -0.1087091 0.0255457 0.0002106 0.0005271 0.0001603 0.1147696 0.1170993 -0.0116135 0.0251267 0.0493664 0.0118104 0.104369 -0.0050126 0.1125226 -0.0619079 0.1170532 -0.0120522 -0.0257236 0.0489189 0.0118658 -0.1044801 0.0042769 -0.1124469 -0.0618635 unknown
polarizability: 195.6736786|-2.9803791|134.1415684|0.0850888|-0.0143937|61.0034359 unknown
InChI: InChI=1S/C10H10N2O2/c1-2-14-10(13)9-7-5-3-4-6-8(7)11-12-9/h3-6,11H,2H2,1H3
charge 0 multiplicity 1
24 atoms
O  2.712183 -0.234016 0.003064
O  1.510776 1.76855 0.002351
N  -0.972378 -2.086362 0.001869
N  0.356727 -1.697336 0.003433
C  -1.039396 0.164649 0.001665
C  -1.862328 -1.011194 0.000633
C  0.322199 -0.328947 0.003637
C  -1.645167 1.448629 0.000843
C  -3.27545 -0.952752 -0.001227
C  -3.049894 1.514466 -0.001041
C  1.5364 0.507444 0.005478
C  -3.852486 0.330622 -0.002064
C  3.976369 0.564613 0.000593
C  5.123456 -0.439842 -0.001787
H  -1.019524 2.344926 0.00173
H  -1.179895 -3.082517 0.00169
H  -3.89528 -1.855005 -0.001984
H  -3.547069 2.490403 -0.001708
H  -4.943878 0.426926 -0.003505
H  3.976457 1.214235 -0.893724
H  3.979983 1.214056 0.895032
H  6.090466 0.095775 -0.00362
H  5.082922 -1.084616 0.892455
H  5.079408 -1.084409 -0.896011
