program: Gaussian 09
title: 000078610
version: EM64L-G09RevD.01
frameworkgroup: C1[X(C22H22N2O4)]
method: RPBEPBE
basis: SDD
operation: Freq
keyword: #p
keyword: freq=noraman
keyword: PBEPBE/SDD
title: #p freq=noraman PBEPBE/SDD
converged: YES YES NO NO
title: Mulliken charges:
elementType: O O O O N N C C C C C C C C C C C C C C C C C C C C C C H H H H H H H H H H H H H H H H H H H H H H
charge: -0.292303 -0.292295 -0.344733 -0.344762 -0.489662 -0.489647 -0.631067 -0.631039 0.299667 0.299708 0.038914 0.038913 0.163539 0.163560 0.404876 0.404871 -0.431383 -0.431387 -0.318409 -0.318424 -0.198793 -0.198795 -0.232626 -0.232637 -0.254289 -0.254299 -0.498462 -0.498463 0.288682 0.234889 0.288676 0.234879 0.374268 0.374283 0.246418 0.246409 0.249979 0.250015 0.227885 0.227883 0.225932 0.225928 0.230258 0.230257 0.238996 0.228282 0.239117 0.239118 0.238992 0.228283
chargesum: 0.00000
title: Mulliken charges with hydrogens summed into heavy atoms:
elementType: O O O O N N C C C C C C C C C C C C C C C C C C C C C C
charge: -0.292303 -0.292295 -0.344733 -0.344762 -0.115394 -0.115364 -0.107496 -0.107484 0.299667 0.299708 0.038914 0.038913 0.163539 0.163560 0.404876 0.404871 -0.184965 -0.184979 -0.068430 -0.068409 0.029092 0.029088 -0.006693 -0.006710 -0.024032 -0.024043 0.207933 0.207930
polarizability: 4.68289519e+02 8.21404546e+01 2.84765942e+02 -2.86955540e-03 1.20583037e-02 1.67584901e+02
1716.lowfreq: -2.4541 -1.3646 0.0003 0.0006 0.0008 4.2484 20.3136 22.9617 30.0923
frequency: 20.3133 22.9617 30.0756 42.1486 42.5912 68.9345 74.1557 81.9954 95.1533 104.1649 105.0941 124.4492 127.7465 146.6492 150.3489 166.2580 182.2909 208.7337 209.1854 237.8966 263.9889 268.7587 293.5035 301.6804 318.0428 323.1866 367.5929 376.7513 407.6765 407.9598 447.4156 485.1013 487.0948 506.8091 511.8515 529.2197 540.1637 566.9875 612.7918 614.9463 616.5248 646.6611 673.3625 690.9101 695.2668 696.8816 716.9453 723.3836 732.1589 756.9828 763.2640 810.6387 826.7703 832.4947 834.2967 858.3067 880.2330 895.7610 897.0403 904.0689 917.6403 920.2025 935.9697 957.2931 965.4482 965.5999 985.4063 985.5202 986.4847 986.5757 1009.7055 1026.6825 1027.8811 1044.9177 1088.3483 1088.4055 1113.2560 1113.2810 1129.3433 1138.6760 1148.8036 1149.9102 1172.3077 1172.3122 1190.5744 1191.4587 1204.4186 1217.7185 1228.6760 1236.6436 1264.0566 1282.7674 1315.9545 1324.1036 1324.6788 1326.9462 1374.9133 1379.7543 1390.2223 1402.8012 1425.4902 1428.6791 1432.9813 1435.8751 1450.4809 1450.4963 1457.8462 1461.5410 1464.5919 1466.0023 1471.5067 1478.6156 1493.8549 1504.8709 1566.0223 1570.1521 1588.0890 1591.5372 1612.2305 1612.3749 1650.1574 1651.1901 2930.8100 2934.1036 3000.9300 3001.0643 3065.0185 3065.9721 3101.0767 3101.1007 3113.6386 3113.8295 3126.7235 3126.7450 3133.3750 3133.3954 3141.9824 3141.9960 3147.0117 3147.0259 3164.6705 3164.7500 3179.8860 3179.8981
redmass: 4.4210 4.9298 4.3538 4.3278 4.9632 4.6931 4.5720 3.5162 1.8957 1.6454 1.2082 4.8438 5.1567 4.1256 4.5523 4.0375 3.6934 3.7231 4.3043 6.1261 6.1720 3.4838 4.0337 4.1350 5.1097 3.8518 5.7724 8.0120 2.9188 2.9020 5.4634 4.6273 4.2286 3.3182 3.6366 6.4632 3.9068 5.6215 6.1822 6.3347 5.8607 5.8820 4.9902 2.5962 1.9678 4.1333 7.8920 4.8606 4.1893 1.8393 1.9715 4.0971 2.2945 1.2775 1.7107 4.2319 4.4180 1.3889 1.4654 4.1286 1.3787 1.2984 1.9113 2.3669 1.3799 1.3781 4.7333 3.8960 1.3830 1.4694 7.1525 2.1698 2.1628 5.4814 1.5772 1.6038 1.2607 1.2593 3.0751 2.4454 1.6130 1.8778 1.0524 1.0515 1.1113 1.1219 1.1497 1.2010 2.7180 2.4328 2.1379 2.0848 3.3689 1.4131 1.4501 2.4989 5.3027 5.4568 4.4817 3.3752 1.4686 1.4865 1.8524 1.8489 1.0507 1.0510 1.4376 1.0807 1.2212 1.0648 2.0139 1.8974 3.0555 3.0584 5.8523 5.3605 6.5061 6.5815 5.5604 5.9445 2.1288 1.9607 1.0706 1.0712 1.0294 1.0294 1.0870 1.0871 1.1043 1.1043 1.0818 1.0818 1.0855 1.0855 1.0884 1.0884 1.1046 1.1046 1.0942 1.0942 1.0982 1.0982 1.0963 1.0963
irintensity: 0.0565 0.0331 0.6973 1.0722 0.2750 0.1791 0.5687 1.3213 0.3817 0.0725 1.5270 0.1786 3.3067 0.2784 5.2950 6.7258 0.3935 7.8118 0.0000 0.0003 16.6010 0.6533 0.1151 0.0280 19.6615 1.5293 23.1749 0.4602 1.1520 0.0007 0.9795 2.5035 2.5458 54.4471 9.6206 0.0416 6.6120 2.1165 6.4295 1.0275 22.7546 2.4670 0.4532 41.2494 29.3570 8.0741 10.4109 36.0860 14.4360 55.1866 42.1588 8.1901 0.2719 0.7524 0.9005 9.7471 5.5529 11.8426 12.1148 30.4976 63.7049 134.1103 2.7928 14.0181 0.0727 1.9068 0.1817 1.1591 1.1746 1.4962 0.8575 18.0758 0.2681 320.4147 13.3911 23.6572 0.2535 0.0676 35.4138 0.8173 228.3124 3.1465 0.3639 0.3068 4.3105 0.4804 68.3773 3.6074 0.2179 138.7137 0.0046 931.8538 62.9565 0.5017 5.8875 0.0336 123.7906 2.2973 224.8673 1.3985 0.2631 9.7466 163.4785 5.1574 2.6818 21.5639 0.0001 6.5175 85.9372 0.1341 114.5222 0.3213 223.6854 1.5726 391.4276 26.1563 257.1743 0.3821 0.4830 277.1408 1.0151 763.6464 22.2114 58.0744 106.1697 3.0992 3.5369 2.0217 6.0735 49.6022 128.4759 210.1808 11.0404 2.8483 1.7240 2.3760 1.4993 31.9719 25.4699 24.4024 68.7913 8.1907 6.8682 5.6630
temp: 298.150 k
press: 1.00000 atm
elementType: 8 8 8 8 7 7 6 6 6 6 6 6 6 6 6 6 6 6 6 6 6 6 6 6 6 6 6 6 1 1 1 1 1 1 1 1 1 1 1 1 1 1 1 1 1 1 1 1 1 1
symmnumber: 1
zpe: 1037699.9 jmol-1
zpe.correction: 0.395239 hartree
zpe.thermalcorrener: 0.421253 hartree
zpe.thermalcorrenthalpy: 0.422197 hartree
zpe.thermalcorrgfe: 0.336720 hartree
zpe.sumelectzpe: -1259.953344 hartree
zpe.sumelectthermal: -1259.927331 hartree
zpe.sumelectthermalent: -1259.926387 hartree
zpe.sumelectthermalfe: -1260.011863 hartree
dipole: 0.0008 0.0002 0.5594
dipole: 0.5594
quadrupole: -145.1019 -152.5295 -159.3654
quadrupole: 15.9832 0.0022 -0.0010
quadrupole: 7.2304 -0.1972 -7.0332 15.9832 0.0022 -0.0010
hfenergy: -1260.3485835 hartree
pointgroup: C01 [X(C22H22N2O4)]
dipole: -0.0003118 0.0000441 -0.2200865 debye
polarizability: 476.9515715|-71.2904786|276.1038903|-0.0021853|-0.0122009|167.5849013 unknown
InChI: InChI=1S/C22H22N2O4/c1-27-21(25)17-13-20(24-16-11-7-4-8-12-16)18(22(26)28-2)14-19(17)23-15-9-5-3-6-10-15/h3-12,23-24H,13-14H2,1-2H3
charge 0 multiplicity 1
50 atoms
O  1.15658 -3.45055 -0.053293
O  -1.15646 3.450532 -0.054213
O  -1.131405 -3.511862 0.397313
O  1.13164 3.511849 0.395925
N  -2.485498 -1.287923 -0.032219
N  2.485493 1.287894 -0.033053
C  1.22834 -0.780346 -0.720375
C  -1.228437 0.780057 -0.720426
C  -1.284024 -0.695607 -0.369338
C  1.283988 0.695413 -0.369754
C  -0.091491 -1.434774 -0.341588
C  0.091463 1.434585 -0.342046
C  -0.103543 -2.837362 0.0260
C  0.103644 2.837288 0.025053
C  -3.812155 -0.781836 -0.0495
C  3.812152 0.781868 -0.050206
C  -4.728045 -1.347414 0.882891
C  4.728199 1.348273 0.881543
C  -4.288097 0.183494 -0.979134
C  4.287984 -0.184233 -0.979099
C  -6.07784 -0.944916 0.896437
C  6.078008 0.945841 0.895203
C  -5.639698 0.589137 -0.947855
C  5.639608 -0.58979 -0.947701
C  -6.543153 0.03425 -0.013402
C  6.543207 -0.034088 -0.013877
C  1.196154 -4.874934 0.341567
C  -1.195858 4.87506 0.340135
H  2.050137 -1.320146 -0.222354
H  1.410101 -0.901165 -1.811069
H  -2.050166 1.319996 -0.222447
H  -1.410351 0.900567 -1.811128
H  -2.35606 -2.276745 0.285733
H  2.35606 2.276836 0.284555
H  -4.367602 -2.095924 1.598076
H  4.367861 2.097396 1.596143
H  -3.625745 0.591768 -1.74586
H  3.625557 -0.593198 -1.745391
H  -6.765699 -1.391631 1.622887
H  6.76597 1.393214 1.621151
H  -5.989371 1.333401 -1.672189
H  5.989177 -1.334661 -1.671462
H  -7.591318 0.350736 0.000457
H  7.591382 -0.350534 0.000081
H  0.540082 -5.474561 -0.311892
H  2.249257 -5.167962 0.223052
H  0.865777 -4.995633 1.387182
H  -0.86514 4.99614 1.385598
H  -0.539976 5.474424 -0.313757
H  -2.248989 5.16808 0.221845
