program: Gaussian 09
title: 000078215
version: EM64L-G09RevD.01
frameworkgroup: C1[X(C9H12O2)]
method: RPBEPBE
basis: SDD
operation: Freq
keyword: #pfreq=noraman
keyword: PBEPBE/SDD
title: #p freq=noraman PBEPBE/SDD
converged: YES YES NO NO
title: Mulliken charges:
elementType: O O C C C C C C C C C H H H H H H H H H H H H
charge: -0.292611 -0.292145 0.370433 0.061393 0.256569 -0.422514 -0.358787 -0.785031 -0.240981 -0.518404 -0.535592 0.232583 0.238276 0.232625 0.243115 0.210063 0.221185 0.258864 0.207849 0.226152 0.226168 0.219703 0.241086
chargesum: 0.00000
title: Mulliken charges with hydrogens summed into heavy atoms:
elementType: O O C C C C C C C C C
charge: -0.292611 -0.292145 0.370433 0.061393 0.256569 -0.189931 -0.120511 -0.099228 -0.019796 0.174462 0.151366
polarizability: 1.31089146e+02 2.15786524e+00 1.23701206e+02 4.24547347e-01 -3.10528357e+00 5.86488986e+01
1716.lowfreq: -6.1108 -0.0008 0.0002 0.0004 6.6751 12.6722 65.7357 85.7830 115.1280
frequency: 65.6736 85.7436 115.1009 118.6763 168.5998 205.1748 207.6764 234.5570 269.6622 295.2549 332.5632 359.5511 471.2683 516.2168 533.9355 540.3641 563.6987 658.5297 735.9193 766.9955 775.4392 863.4232 885.8395 949.3941 960.4282 985.8498 1044.6874 1056.6367 1091.2787 1110.0047 1111.4246 1150.0209 1152.1603 1180.7977 1188.7550 1240.5232 1272.6194 1376.4130 1398.9418 1417.9767 1433.1983 1445.5598 1455.0884 1457.5108 1462.8457 1467.0931 1474.9165 1482.4084 1486.8349 1590.1875 1601.7012 2960.2989 2972.5269 2985.2048 3048.3820 3065.5527 3081.6069 3090.5029 3121.8547 3123.0449 3127.6775 3146.9388 3167.2021
redmass: 2.3798 2.7202 1.4472 1.6044 1.4711 3.2565 2.0491 2.3296 1.8039 2.8681 3.3252 4.1178 5.5670 4.8793 4.6060 3.7363 3.7880 4.8842 2.3182 1.8626 5.0336 1.3533 4.6478 1.3186 7.3195 1.9374 1.5312 4.1011 1.7700 1.2351 1.2581 1.3979 1.3812 1.5420 2.3939 1.9649 2.6470 6.5071 1.2955 1.3555 1.2983 1.4160 1.1017 1.0744 2.2275 1.0565 1.0845 1.0865 1.2997 5.7363 7.6589 1.0326 1.0348 1.0361 1.1039 1.0968 1.0966 1.1005 1.0996 1.1047 1.0863 1.0920 1.0974
irintensity: 2.8713 10.6331 0.5783 3.2609 2.2121 1.6898 1.4154 4.3568 2.6617 3.3985 2.2412 5.1378 4.1231 1.4770 1.1220 0.2424 1.5274 11.4976 30.3556 54.1767 5.9258 0.0421 1.9083 0.6232 42.3207 28.5907 7.5785 92.5173 35.7037 4.7348 0.1126 4.9812 7.7662 26.0096 59.8985 75.0047 75.4969 9.4061 10.8160 14.7038 19.6684 44.4589 9.1095 6.0139 26.1432 14.0782 67.1565 37.9656 24.0926 18.2974 21.2996 68.8106 80.5983 30.3269 47.1791 18.6958 43.9224 19.7652 22.9322 18.3333 5.1603 23.0578 18.5985
temp: 298.150 k
press: 1.00000 atm
elementType: 8 8 6 6 6 6 6 6 6 6 6 1 1 1 1 1 1 1 1 1 1 1 1
symmnumber: 1
zpe: 494691.2 jmol-1
zpe.correction: 0.188418 hartree
zpe.thermalcorrener: 0.200063 hartree
zpe.thermalcorrenthalpy: 0.201007 hartree
zpe.thermalcorrgfe: 0.151156 hartree
zpe.sumelectzpe: -499.732977 hartree
zpe.sumelectthermal: -499.721332 hartree
zpe.sumelectthermalent: -499.720388 hartree
zpe.sumelectthermalfe: -499.770239 hartree
dipole: 1.9906 -0.6761 1.2097
dipole: 2.4255
quadrupole: -53.9011 -60.2668 -69.1774
quadrupole: -1.2048 -0.0868 2.5433
quadrupole: 7.2140 0.8483 -8.0623 -1.2048 -0.0868 2.5433
hfenergy: -499.9213949 hartree
pointgroup: C01 [X(C9H12O2)]
dipole: 0.7742105 -0.2995851 0.4706033 debye
dipolederiv: -0.3962946 -0.3293195 -0.0251879 -0.2546076 -1.3784908 -0.159135 -0.0079444 0.0709931 -0.3405938 -1.5583369 -0.1128218 0.0734192 -0.2853768 -0.4051007 0.0126065 0.0871376 -0.0088482 -0.2853386 0.2666753 -0.2271614 0.0304632 -0.1088245 -0.0040585 -0.0513434 0.0371283 -0.0727856 -0.0276532 -0.2380119 -0.0138388 -0.0679585 0.1964842 1.1574777 0.0341578 -0.0661889 -0.1912351 -0.0362267 1.1308911 0.4004772 -0.0684442 0.492111 0.0483142 -0.0520962 -0.0690209 0.0374938 0.0727341 -0.0699133 0.0958995 -0.0067736 0.0722415 -0.0959507 -0.0009967 -0.0067352 -0.0108841 -0.2053924 -0.1492969 0.0332358 0.0006974 -0.2038336 -0.107033 0.0010686 0.023662 -0.0013995 -0.2116384 0.0010018 0.1226999 -0.0152559 0.1632902 -0.0262903 0.0129191 -0.0425949 0.0171018 0.0600422 0.0632556 -0.0605293 0.0078922 0.0291995 0.0420065 -0.0322129 0.0029072 -0.0242969 -0.1565037 0.3321911 0.3740887 0.0769106 0.1391785 0.5627126 0.1306731 0.0729939 0.2502683 0.4062896 0.7832791 -0.0796062 -0.0214861 -0.3286219 0.2570485 0.0161995 0.003674 0.000437 0.3214468 -0.1017211 -0.0933621 0.0027311 -0.0670692 0.0469848 0.0037405 -0.0013484 0.0150721 0.161295 -0.0587486 0.0965885 -0.0071606 0.0888041 0.0421025 0.0064828 -0.0117022 0.0067353 0.167935 0.0546412 0.0103019 -0.0262827 0.0534209 -0.0210409 -0.1132767 0.0355216 -0.1226196 -0.0056682 0.0397934 0.0316928 0.0089116 0.0479505 0.055701 0.0892957 -0.0538745 0.0960824 -0.0687673 -0.0987602 -0.05993 0.015844 -0.1660227 -0.0017504 0.019809 0.0334369 0.0161381 0.0997344 0.0743049 -0.0085379 -0.0003144 -0.0153358 -0.1356557 0.0256674 -0.0022852 0.0284103 0.1593256 -0.1241857 -0.0858583 -0.0141437 0.0155051 0.1320332 -0.0089198 0.0040727 -0.0402644 0.0606529 0.0338354 -0.0714011 0.0565955 -0.0406652 0.0355523 0.0602402 0.0110754 -0.1069509 -0.1933946 0.0820913 0.0624999 -0.0268003 0.0167285 -0.1856268 0.01682 -0.0316093 0.0331112 0.0792731 0.0133509 -0.0122148 -0.0281184 0.1460564 -0.0301669 -0.1322487 0.0253137 -0.1072708 -0.0668514 0.0007664 0.0040426 0.015726 0.1512754 0.0038981 0.1012182 -0.0637429 0.0995714 -0.1088654 -0.0808083 -0.0769453 0.0187355 -0.1418886 0.007333 0.0193311 0.0201233 0.0151405 0.1181649 unknown
polarizability: 131.1670407|1.9915238|123.7546625|0.9308787|-0.7165334|58.5175472 unknown
InChI: InChI=1S/C9H12O2/c1-7-5-4-6-8(10-2)9(7)11-3/h4-6H,1-3H3
charge 0 multiplicity 1
23 atoms
O  -0.367304 1.87845 -0.242458
O  2.039972 0.396025 -0.098247
C  -1.643507 -0.146448 -0.029241
C  -0.369428 0.481765 -0.057935
C  0.821303 -0.305629 0.00192
C  -1.709424 -1.558014 0.084237
C  0.732915 -1.711717 0.131332
C  -2.898026 0.698264 -0.133508
C  -0.534985 -2.332947 0.172469
C  0.459598 2.702234 0.662374
C  3.272381 -0.394225 -0.111554
H  -2.691435 -2.043529 0.109739
H  1.638289 -2.323377 0.185858
H  -2.902525 1.504469 0.62178
H  -2.960707 1.197665 -1.117713
H  -3.800744 0.078367 0.002773
H  -0.599934 -3.422109 0.2685
H  1.532513 2.513845 0.498178
H  0.200482 2.497686 1.719659
H  0.201797 3.742486 0.409416
H  3.285227 -1.102007 -0.96288
H  3.407642 -0.951135 0.836198
H  4.082699 0.34078 -0.228097
