program: Gaussian 09
title: 000078200
version: EM64L-G09RevD.01
frameworkgroup: C1[X(C5H10O3S)]
method: RPBEPBE
basis: SDD
operation: Freq
keyword: #p
keyword: freq=noraman
keyword: PBEPBE/SDD
title: #p freq=noraman PBEPBE/SDD
converged: YES YES NO NO
title: Mulliken charges:
elementType: S O O O C C C C C H H H H H H H H H H
charge: 0.680961 -0.248728 -0.603878 -0.239736 -0.723356 0.313698 -0.222640 -0.808622 -0.670790 0.308535 0.263824 0.234225 0.229702 0.279915 0.278006 0.248290 0.211386 0.229179 0.240030
chargesum: 0.00000
title: Mulliken charges with hydrogens summed into heavy atoms:
elementType: S O O O C C C C C
charge: 0.680961 -0.248728 -0.603878 -0.239736 -0.150998 0.313698 0.241288 -0.002411 0.009805
polarizability: 1.21420839e+02 1.01858760e+00 8.89489900e+01 1.44930432e+00 -2.35314214e+00 6.43648882e+01
1716.lowfreq: -0.0019 -0.0018 0.0024 4.8242 6.9901 9.9001 25.3723 29.6304 58.5427
frequency: 23.0121 29.3729 58.4828 97.7935 159.6490 174.2181 184.4032 206.6784 241.5087 267.5914 287.7995 344.0348 397.7510 453.0083 545.1525 622.0692 723.4288 782.2926 798.7489 809.3446 884.1614 926.1116 947.9927 960.9635 1024.9311 1070.0726 1115.2933 1135.0187 1178.3404 1233.1194 1249.8753 1302.4980 1355.0228 1399.8876 1403.5071 1418.1373 1437.1324 1463.6471 1473.0894 1486.4352 1614.4196 2997.6140 3010.7304 3015.9749 3065.3945 3070.1669 3094.4808 3110.4199 3157.8829 3162.7077 3170.9609
redmass: 4.8978 4.0628 3.1099 3.2765 3.5282 1.6096 1.6616 2.9809 1.9503 2.2855 4.4519 3.5928 2.7761 5.4046 6.7186 5.1629 6.8412 3.1127 1.1071 8.8692 1.7966 2.6652 1.6254 1.3695 2.4053 1.5480 2.2068 1.4613 1.1911 2.4195 1.1377 1.1409 1.3747 1.1634 1.2468 1.0551 1.0579 1.0396 1.0647 1.0654 10.3007 1.0360 1.0581 1.0261 1.0546 1.1068 1.0986 1.1025 1.1065 1.1059 1.1125
irintensity: 7.1058 4.7939 2.3662 0.4282 4.2015 5.2296 3.5969 1.4900 0.8948 9.1354 7.3582 10.2731 2.9362 27.1537 16.2793 2.6226 4.3849 8.1095 3.4614 38.2636 0.6212 16.4953 24.6446 9.5049 63.9101 163.7826 2.8335 7.0238 8.7695 334.8603 1.2666 5.1375 1.7472 39.9627 14.1198 12.2956 15.8143 12.5026 3.5237 15.5457 226.9276 19.5887 17.3692 6.1896 3.4139 8.5016 28.1755 38.4022 6.8310 2.6463 0.8135
temp: 298.150 k
press: 1.00000 atm
elementType: 16 8 8 8 6 6 6 6 6 1 1 1 1 1 1 1 1 1 1
symmnumber: 1
zpe: 383656.3 jmol-1
zpe.correction: 0.146127 hartree
zpe.thermalcorrener: 0.158087 hartree
zpe.thermalcorrenthalpy: 0.159031 hartree
zpe.thermalcorrgfe: 0.106058 hartree
zpe.sumelectzpe: -819.444050 hartree
zpe.sumelectthermal: -819.432090 hartree
zpe.sumelectthermalent: -819.431146 hartree
zpe.sumelectthermalfe: -819.484119 hartree
dipole: 0.3368 -2.0958 1.8287
dipole: 2.8018
quadrupole: -43.7051 -74.0944 -61.0515
quadrupole: -9.5917 2.8923 -2.8699
quadrupole: 15.9119 -14.4774 -1.4345 -9.5917 2.8923 -2.8699
hfenergy: -819.590177 hartree
pointgroup: C01 [X(C5H10O3S1)]
dipole: 0.1559417 -0.6959681 -0.8404546 debye
dipolederiv: 0.736777 -0.0665381 0.0754306 0.083847 0.4558535 0.2434945 0.1619455 0.3696086 0.8136917 -1.5540147 0.0187729 0.3168167 0.0932114 -0.3592663 0.1237456 0.5944573 0.1094254 -0.5214573 -0.3985904 0.0710206 0.0152166 -0.0137932 -0.4036109 0.1342512 -0.097034 -0.3152617 -0.6289463 -0.6458679 0.0868714 -0.0661096 0.0774088 -0.5042093 0.4543269 0.1269034 0.2112594 -0.7991435 -0.6264791 0.0707211 -0.3551165 0.024157 -0.0915579 -0.0760795 -0.2183831 0.0312065 -0.191987 1.7549701 -0.1181284 -0.0076401 -0.3483494 0.4760404 -0.7984189 -0.6194942 -0.3963355 0.9648528 0.9198755 -0.0614183 -0.0945008 -0.1803941 0.3244797 0.0915638 -0.0436404 0.0622365 0.3094887 -0.1755992 0.0547653 0.0544857 0.1163578 -0.0968214 -0.0894162 0.0671503 -0.0220802 -0.0527522 -0.0858725 -0.0190363 0.0768419 0.0041398 0.0554891 0.0232265 0.0782145 0.0163203 -0.0304058 0.0689635 -0.0189997 -0.0308245 -0.0049397 0.0128096 0.0184742 -0.0440883 0.0401955 0.0237464 0.0039629 0.0242881 0.0381356 0.0377358 0.0700955 -0.0156818 0.0606958 -0.0458089 -0.0005174 -0.0666529 -0.0694637 0.0181436 0.0258596 -0.1137286 -0.0094253 -0.0022246 -0.0018107 0.0668506 -0.0546609 0.0129116 0.0009514 0.0351229 0.0565719 -0.0596157 -0.0734303 -0.0262557 -0.1080191 0.0468841 -0.0302789 0.0492972 0.0146767 -0.0584927 0.0221893 0.0310041 0.0310556 0.0845397 -0.0194799 -0.0216106 -0.04023 -0.021727 0.080239 -0.0481203 -0.0615145 -0.0425743 0.0683184 0.0264718 0.0251418 0.0381967 0.0712045 0.0918517 -0.0027987 0.0659056 0.0130943 -0.081222 -0.1234121 0.0980454 0.0034272 0.1155052 0.0438355 0.0206008 -0.0036248 0.0309307 0.0924966 0.1090667 -0.0295685 0.0050963 -0.084899 -0.1311982 -0.001142 0.0173744 -0.0321167 0.0791801 0.0836581 -0.0274957 -0.0976177 -0.0451241 0.0916193 -0.0311742 -0.0402166 -0.0330893 -0.0887143 unknown
polarizability: 120.6634153|-5.0800641|64.6257218|3.5254301|1.0013576|89.44558 unknown
InChI: InChI=1S/C5H10O3S/c1-3-8-5(6)4-9(2)7/h3-4H2,1-2H3
charge 0 multiplicity 1
19 atoms
S  1.972064 0.182206 0.454005
O  -1.55591 -0.548452 -0.011141
O  1.661662 -0.0953 2.063466
O  -0.618325 0.543823 -1.855127
C  0.716201 -1.031575 -0.538444
C  -0.52352 -0.268848 -0.901307
C  -2.828377 0.215342 -0.217254
C  3.526327 -0.904927 0.09295
C  -3.791591 -0.236474 0.874268
H  0.545623 -1.856254 0.167714
H  1.269078 -1.322907 -1.442825
H  -2.592488 1.293318 -0.159364
H  -3.200277 -0.00274 -1.234781
H  3.289221 -1.930919 0.410896
H  4.326794 -0.479508 0.714989
H  3.770973 -0.844738 -0.978494
H  -4.748426 0.307871 0.775755
H  -3.997265 -1.317732 0.797465
H  -3.374963 -0.031286 1.874728
