program: Gaussian 09
title: 000078303
version: EM64L-G09RevD.01
frameworkgroup: C1[X(C16H28O6P2)]
method: RPBEPBE
basis: SDD
operation: Freq
keyword: #p
keyword: freq=noraman
keyword: PBEPBE/SDD
title: #p freq=noraman PBEPBE/SDD
converged: YES YES NO NO
title: Mulliken charges:
elementType: P P O O O O O O C C C C C C C C C C C C C C C C H H H H H H H H H H H H H H H H H H H H H H H H H H H H
charge: 1.296249 1.296340 -0.540070 -0.496290 -0.540047 -0.496249 -0.623550 -0.623475 -0.934964 -0.935113 0.520376 0.520420 -0.339002 -0.339030 -0.432924 -0.432712 -0.213983 -0.227325 -0.213852 -0.227207 -0.655562 -0.659072 -0.655715 -0.659107 0.304075 0.275320 0.304152 0.275264 0.270699 0.270736 0.228626 0.228528 0.241637 0.211966 0.210163 0.224849 0.241517 0.212040 0.210036 0.224779 0.210687 0.224926 0.230077 0.202799 0.232635 0.237598 0.210710 0.224883 0.230110 0.202802 0.232652 0.237597
chargesum: 0.00000
title: Mulliken charges with hydrogens summed into heavy atoms:
elementType: P P O O O O O O C C C C C C C C C C C C C C C C
charge: 1.296249 1.296340 -0.540070 -0.496290 -0.540047 -0.496249 -0.623550 -0.623475 -0.355569 -0.355698 0.520376 0.520420 -0.068303 -0.068294 -0.204299 -0.204183 0.239620 0.207686 0.239705 0.207609 0.010129 0.013960 0.009987 0.013945
polarizability: 3.39266324e+02 -2.25813460e+01 1.95602739e+02 4.25978049e-02 3.27802697e-02 2.23002171e+02
1716.lowfreq: -3.1630 -0.0007 -0.0005 0.0007 0.9819 11.3192 12.1266 13.4804 16.3347
frequency: 12.0634 13.4762 16.3303 23.2468 24.6156 30.8778 34.8910 47.6850 51.0564 51.3248 68.7739 69.7678 75.5671 81.5926 95.7271 110.0612 124.9781 125.1280 159.4572 180.8579 196.9588 206.4474 233.9026 237.7550 244.1564 245.1642 246.1991 255.9945 274.9488 275.8695 297.0200 297.4740 312.1296 335.0815 358.1784 365.5214 392.6357 394.7826 403.0738 446.3381 454.6662 522.9001 537.2360 606.4003 613.1998 633.2094 660.6359 669.4550 701.2639 706.3826 749.8127 772.4205 806.4709 806.7216 816.0072 816.0657 829.4719 831.6991 851.1516 866.1773 876.0440 878.1533 880.3390 886.0348 901.3564 953.2913 977.9773 1013.9522 1018.2578 1018.5236 1024.6466 1025.5816 1039.2483 1041.4607 1102.7962 1103.5917 1103.7386 1105.1717 1113.2962 1131.5550 1131.5974 1136.4012 1136.4636 1155.3405 1162.0345 1199.3653 1217.4602 1218.5958 1254.1524 1254.3901 1256.8449 1256.9464 1260.2113 1260.8061 1321.8180 1355.4822 1355.5776 1357.7561 1357.9004 1381.7507 1393.3697 1393.4255 1393.8189 1393.8252 1411.3995 1421.9516 1426.3301 1455.9429 1455.9644 1459.6735 1459.6802 1477.6308 1477.6721 1479.1505 1479.1921 1488.6754 1488.7304 1492.5291 1492.5688 1506.4413 1582.3039 1625.0259 2968.1016 2968.2063 2987.6014 2987.6323 2993.3810 2993.4358 2994.4206 2994.4635 3024.3611 3024.4490 3031.4941 3031.6596 3050.9716 3051.0140 3089.6430 3089.6891 3091.4120 3091.4450 3096.0092 3096.1946 3105.9868 3106.0177 3109.3091 3110.5512 3110.5706 3132.1678 3133.2469 3152.0525
redmass: 3.6372 4.3564 3.9977 3.0105 3.0643 4.1127 4.1238 2.4493 2.5541 2.9232 3.3341 2.2475 1.9983 3.2300 4.6077 4.9290 4.6411 4.1025 5.7098 6.5420 5.7967 3.9152 1.5950 2.0055 2.4743 1.2211 1.2038 2.4968 2.9215 2.9768 4.2197 4.2316 2.5274 3.2982 4.5593 3.4881 4.1198 4.8839 2.8363 4.9455 7.2405 3.9324 5.7603 5.4309 4.4411 6.4140 5.6077 6.0305 5.9849 4.1083 3.6614 3.8865 1.0910 1.0908 1.0978 1.0944 1.4841 5.1726 1.3946 2.0235 3.1215 3.5662 3.6794 2.8761 2.0659 1.4111 1.3894 3.0132 2.7609 2.7642 2.7867 2.8383 5.4299 6.0229 1.9044 2.1838 2.1762 2.1672 1.6634 1.4212 1.4211 1.4451 1.4457 1.1787 1.1422 1.1236 3.3780 1.7239 1.1440 1.1436 1.1521 1.1603 1.4863 1.4408 1.2586 1.2590 1.2588 1.2522 1.2525 5.5858 1.2408 1.2410 1.2495 1.2498 2.0209 1.1018 1.3140 1.0399 1.0399 1.0407 1.0407 1.0517 1.0514 1.0475 1.0477 1.0817 1.0804 1.0853 1.0840 2.6276 6.6834 6.3356 1.0560 1.0560 1.0536 1.0535 1.0394 1.0395 1.0368 1.0369 1.0604 1.0603 1.1063 1.1063 1.1074 1.1074 1.0983 1.0983 1.0981 1.0981 1.1020 1.1020 1.1021 1.1021 1.0872 1.1016 1.1017 1.0889 1.0968 1.0978
irintensity: 0.1666 0.3533 0.0723 0.0290 0.9996 1.4983 0.1524 1.7348 0.6928 0.8731 3.2979 0.2826 8.9096 1.7379 1.6866 2.8162 0.2318 9.4798 26.2336 0.0819 0.1947 3.5006 1.1126 2.7519 5.6220 0.0538 0.1913 0.2887 27.2063 1.4185 9.0539 11.4271 0.5623 26.1307 1.9052 4.9992 21.4257 4.9403 0.0123 54.6471 3.4228 112.7348 2.0678 10.3354 74.2718 46.5348 207.1779 2.7570 5.0686 71.8684 1.0382 54.1661 3.6523 3.4978 3.0675 1.1386 24.5430 0.6359 20.5878 17.1381 112.6189 384.2512 12.4698 96.8914 125.8845 0.9216 6.0063 20.9072 97.4151 190.4943 259.8101 17.9749 77.7546 1.1528 0.0064 13.7290 0.7670 10.1799 81.5568 8.3148 0.4662 4.5925 6.6787 4.7696 13.7382 0.3535 0.2549 0.5433 0.8916 1.0879 6.7888 0.2002 0.4140 8.7885 2.2149 6.7132 5.2261 7.0195 6.7558 0.1641 23.6430 7.4743 41.4189 27.6008 2.7042 30.1103 9.2140 20.0204 0.1559 12.2938 12.4605 4.3195 9.9831 1.1705 4.4384 15.4895 7.7576 6.6755 3.5144 46.5965 0.6062 0.0015 25.4972 41.8988 46.0878 19.2811 58.9257 8.9415 29.1781 20.2194 12.0227 4.3078 48.3015 13.7400 11.2080 11.4371 33.3129 31.5049 8.0863 45.3103 0.5119 3.5139 36.8411 37.3302 28.3112 60.7840 1.0331 4.0166 20.5509 0.0752
temp: 298.150 k
press: 1.00000 atm
elementType: 15 15 8 8 8 8 8 8 6 6 6 6 6 6 6 6 6 6 6 6 6 6 6 6 1 1 1 1 1 1 1 1 1 1 1 1 1 1 1 1 1 1 1 1 1 1 1 1 1 1 1 1
symmnumber: 1
zpe: 1105141.0 jmol-1
zpe.correction: 0.420926 hartree
zpe.thermalcorrener: 0.451749 hartree
zpe.thermalcorrenthalpy: 0.452693 hartree
zpe.thermalcorrgfe: 0.351353 hartree
zpe.sumelectzpe: -1758.381084 hartree
zpe.sumelectthermal: -1758.350261 hartree
zpe.sumelectthermalent: -1758.349317 hartree
zpe.sumelectthermalfe: -1758.450657 hartree
dipole: 0.0059 0.0031 7.8762
dipole: 7.8762
quadrupole: -124.5771 -159.9076 -165.5258
quadrupole: -9.5651 -0.0123 0.0060
quadrupole: 25.4264 -9.9041 -15.5223 -9.5651 -0.0123 0.0060
hfenergy: -1758.8020098 hartree
pointgroup: C01 [X(C16H28O6P2)]
dipole: 0.000673 3.0987302 -0.0013815 debye
polarizability: 336.8478121|0.1083773|223.0022501|29.1806274|-0.0169315|198.0211723 unknown
InChI: InChI=1S/C16H28O6P2/c1-5-19-23(17,20-6-2)13-15-9-11-16(12-10-15)14-24(18,21-7-3)22-8-4/h9-12H,5-8,13-14H2,1-4H3
charge 0 multiplicity 1
52 atoms
P  -4.010378 -0.693959 -0.204868
P  4.003224 -0.689893 0.211462
O  -5.402309 -0.112875 -1.085141
O  -4.077517 0.114492 1.337651
O  5.394967 -0.110035 1.092849
O  4.073114 0.118239 -1.331128
O  -3.926228 -2.269693 -0.010226
O  3.917353 -2.265503 0.016742
C  -2.667159 0.123324 -1.246243
C  2.660008 0.129119 1.251552
C  -1.300651 0.118207 -0.592795
C  1.293204 0.12094 0.598763
C  -0.643248 -1.103364 -0.288732
C  0.636571 -1.102029 0.298674
C  -0.64637 1.337292 -0.291787
C  0.63809 1.338625 0.293921
C  -6.685863 -0.865034 -0.957206
C  -4.266892 1.589926 1.394632
C  6.678506 -0.861966 0.963815
C  4.260927 1.593768 -1.388391
C  -7.589466 -0.379052 -2.08707
C  -4.481226 1.933472 2.866702
C  7.586743 -0.367696 2.086329
C  4.47485 1.937241 -2.860548
H  -2.676639 -0.458765 -2.185278
H  -3.016983 1.142863 -1.477086
H  2.67074 -0.450406 2.192144
H  3.008958 1.149627 1.479421
H  -1.144602 -2.054464 -0.502192
H  1.138585 -2.052108 0.515031
H  -1.136005 2.290935 -0.525552
H  1.12709 2.293334 0.524648
H  -6.474443 -1.948486 -1.029704
H  -7.125093 -0.654341 0.036892
H  -3.35957 2.08972 0.99862
H  -5.138028 1.876619 0.773661
H  6.468267 -1.945048 1.044524
H  7.113139 -0.657774 -0.033674
H  3.353191 2.092887 -0.992457
H  5.13184 1.881498 -0.767564
H  -8.568059 -0.891348 -2.033134
H  -7.760263 0.708703 -2.012423
H  -7.134707 -0.595131 -3.068696
H  -4.611667 3.025084 2.988942
H  -5.378965 1.424408 3.25595
H  -3.613139 1.612211 3.466429
H  8.565321 -0.879945 2.031792
H  7.756683 0.719588 2.00336
H  7.136303 -0.577101 3.07139
H  4.604539 3.028918 -2.982986
H  5.372914 1.428735 -3.249782
H  3.606944 1.615244 -3.460136
