program: Gaussian 09
title: 000078203
version: EM64L-G09RevD.01
frameworkgroup: C1[X(C14H15O2P)]
method: RPBEPBE
basis: SDD
operation: Freq
keyword: #p
keyword: freq=noraman
keyword: PBEPBE/SDD
title: #p freq=noraman PBEPBE/SDD
converged: YES YES NO NO
title: Mulliken charges:
elementType: P O O C C C C C C C C C C C C C C H H H H H H H H H H H H H H H
charge: 0.941945 -0.667123 -0.248135 -0.116419 -0.091032 -0.516908 -0.310308 -0.238313 -0.252371 -0.294797 -0.210100 -0.246325 -0.229746 -0.209594 -0.224692 -0.223755 -0.506541 0.247850 0.247257 0.295957 0.227574 0.236376 0.287735 0.234491 0.232106 0.232450 0.233872 0.232558 0.232112 0.267109 0.206400 0.230367
chargesum: 0.00000
title: Mulliken charges with hydrogens summed into heavy atoms:
elementType: P O O C C C C C C C C C C C C C C
charge: 0.941945 -0.667123 -0.248135 -0.116419 -0.091032 -0.021801 -0.014352 -0.010739 -0.015996 -0.007063 0.024391 -0.014219 0.002704 0.024278 0.007867 0.008357 0.197335
polarizability: 2.10421348e+02 -8.29424734e+00 1.56420762e+02 -3.82833796e+00 1.43850863e+01 1.58997741e+02
1716.lowfreq: -7.3407 -0.0019 -0.0016 0.0007 4.7366 11.0106 26.9987 34.1179 39.5544
frequency: 26.9700 33.9564 39.4359 52.5607 68.6052 106.6876 142.9825 158.5176 163.2582 193.6008 203.4102 226.2244 262.4410 272.7213 362.5924 367.0375 397.2876 398.9950 418.4417 455.7000 483.4655 532.3947 611.1505 611.6437 634.2101 676.8143 697.4604 702.2108 708.2061 759.3512 768.3117 844.8347 859.8565 863.2163 880.9654 931.5555 935.8935 962.4736 983.2052 986.4356 987.6544 990.1345 1003.7294 1008.3262 1019.7637 1021.2730 1057.9719 1074.5568 1082.5245 1085.7414 1090.7144 1119.9198 1154.8058 1173.0360 1174.2085 1186.8649 1191.1361 1247.0309 1288.5191 1309.7066 1314.3068 1378.2160 1379.9532 1413.1988 1424.8173 1427.1562 1440.3170 1457.5069 1463.7883 1467.4364 1480.5385 1586.7180 1589.0787 1594.9156 1597.2538 2954.0951 2957.5484 3049.8910 3077.2906 3120.7899 3124.0056 3125.3535 3128.2604 3131.3874 3137.4400 3140.4574 3149.8562 3151.8515 3165.1612 3166.0507
redmass: 3.6406 3.8617 4.3042 4.5593 4.8286 2.9196 2.7697 1.9513 3.8543 3.0809 4.5533 5.2241 4.7429 5.9698 6.7858 2.8733 2.7845 2.8237 3.8713 4.2252 4.0833 5.3215 6.4409 6.4137 5.9580 6.4878 6.1018 1.9139 1.8083 1.6945 1.8020 4.0854 1.2632 1.2523 1.9989 1.3870 1.3818 6.4045 1.4424 6.0723 1.4226 4.5724 1.3355 1.3240 3.0163 2.9609 5.2375 1.6661 1.6552 2.5857 2.7036 1.2539 1.3911 1.0573 1.0557 1.1244 1.1243 1.2051 1.1929 1.3170 1.3062 8.5555 8.7857 1.0811 2.1067 2.1117 1.1258 1.0532 2.0463 2.0363 1.0548 6.0915 6.0863 5.8470 5.8410 1.0380 1.0587 1.1018 1.0989 1.0864 1.1013 1.0851 1.0871 1.0878 1.0917 1.0923 1.0960 1.0965 1.1015 1.1016
irintensity: 1.5623 0.1654 0.2674 0.1538 0.1755 1.4298 10.9380 0.0966 11.6644 5.7636 9.8518 5.0506 0.4758 3.9758 1.1043 18.4719 0.4441 0.0311 23.3301 8.5263 41.4927 119.7341 0.2088 0.7308 11.7812 7.4403 15.9766 55.8676 86.8417 18.0256 29.5923 17.1401 0.3229 0.7915 13.9220 0.2557 0.4150 52.3263 0.6263 1.9195 0.8719 2.6925 0.2264 0.3267 3.7812 1.8105 125.4184 12.1613 8.2110 36.5885 23.4198 3.2374 25.2162 0.2713 0.1099 5.7169 1.1941 5.5913 7.7317 2.5244 5.9396 0.7329 0.7249 9.2238 3.8681 35.1278 6.8764 12.3792 11.1985 5.6020 18.1720 0.1477 0.3845 1.1813 0.2344 64.9947 42.2607 31.8505 11.6528 3.4964 22.0481 1.3234 2.5028 4.1002 3.5235 6.8707 20.9161 27.5473 43.5325 25.0478
temp: 298.150 k
press: 1.00000 atm
elementType: 15 8 8 6 6 6 6 6 6 6 6 6 6 6 6 6 6 1 1 1 1 1 1 1 1 1 1 1 1 1 1 1
symmnumber: 1
zpe: 661818.1 jmol-1
zpe.correction: 0.252073 hartree
zpe.thermalcorrener: 0.268787 hartree
zpe.thermalcorrenthalpy: 0.269731 hartree
zpe.thermalcorrgfe: 0.205647 hartree
zpe.sumelectzpe: -1032.890217 hartree
zpe.sumelectthermal: -1032.873504 hartree
zpe.sumelectthermalent: -1032.872560 hartree
zpe.sumelectthermalfe: -1032.936643 hartree
dipole: -0.8545 -1.8561 -2.6291
dipole: 3.3298
quadrupole: -94.3339 -102.3526 -108.1438
quadrupole: -3.0008 2.3226 -0.0108
quadrupole: 7.2762 -0.7425 -6.5337 -3.0008 2.3226 -0.0108
hfenergy: -1033.1422905 hartree
pointgroup: C01 [X(C14H15O2P1)]
dipole: -0.4307661 -0.599572 -1.0822118 debye
polarizability: 209.2611315|-6.1538957|152.8521022|-9.0999516|14.2107764|163.7266175 unknown
InChI: InChI=1S/C14H15O2P/c1-16-12-17(15,13-8-4-2-5-9-13)14-10-6-3-7-11-14/h2-11H,12H2,1H3
charge 0 multiplicity 1
32 atoms
P  0.073978 0.892486 0.364341
O  0.255304 1.394111 1.899008
O  1.517917 2.817579 -1.125377
C  -1.630596 0.15074 0.098916
C  1.348715 -0.387563 -0.119319
C  0.184344 2.305654 -0.940262
C  -2.546677 0.28869 1.167796
C  1.693148 -0.667341 -1.462154
C  -2.00984 -0.510594 -1.09281
C  1.98584 -1.071614 0.942702
C  -3.85341 -0.233962 1.039068
C  2.664986 -1.654467 -1.742536
C  -3.318702 -1.029628 -1.217221
C  2.954892 -2.058863 0.657053
C  -4.240701 -0.889424 -0.15306
C  3.291292 -2.354307 -0.684916
C  1.996766 3.626274 0.014754
H  -0.146902 1.912133 -1.915887
H  -0.533889 3.078384 -0.590449
H  -2.2142 0.791451 2.083994
H  1.239255 -0.10825 -2.288398
H  -1.294582 -0.646978 -1.913071
H  1.725238 -0.81111 1.975176
H  -4.565512 -0.132497 1.865438
H  2.940104 -1.868947 -2.781021
H  -3.615905 -1.546456 -2.136355
H  3.448468 -2.591733 1.477154
H  -5.25416 -1.29461 -0.251288
H  4.045227 -3.11833 -0.905663
H  2.001977 3.035415 0.949622
H  1.353181 4.519215 0.152416
H  3.017042 3.936243 -0.256046
