program: Gaussian 09
title: 000078160
version: EM64L-G09RevD.01
frameworkgroup: C1[X(C6H11NS2)]
method: RPBEPBE
basis: SDD
operation: Freq
keyword: #p
keyword: freq=noraman
keyword: PBEPBE/SDD
title: #p freq=noraman PBEPBE/SDD
converged: NO NO NO NO
title: Mulliken charges:
elementType: S S N C C C C C C H H H H H H H H H H H
charge: 0.165153 0.105040 0.243330 -0.321474 -0.355132 -0.671135 -0.408362 -0.842606 -0.524951 0.237435 0.210754 0.206673 0.219307 0.250768 0.243450 0.234233 0.243200 0.255777 0.255434 0.253106
chargesum: 0.00000
title: Mulliken charges with hydrogens summed into heavy atoms:
elementType: S S N C C C C C C
charge: 0.165153 0.105040 0.243330 0.126714 0.070848 -0.176917 0.069071 -0.078289 -0.524951
polarizability: 1.32826068e+02 1.91936855e+01 1.12178305e+02 2.34192181e-01 -9.76405163e-02 6.89699594e+01
1716.lowfreq: 0.0013 0.0018 0.0020 1.7829 7.1902 13.2617 20.7297 29.5144 45.5209
frequency: 19.8503 29.0127 45.2827 70.6266 97.8375 101.7984 143.0222 160.4959 216.3109 282.8888 329.2935 395.6754 397.5532 474.1809 609.2962 664.7257 710.2479 755.9041 827.2514 869.9991 953.4367 970.1081 975.2535 1043.9605 1065.8943 1076.7448 1114.4726 1154.0790 1224.7482 1254.6945 1268.2408 1295.8485 1318.0165 1339.9213 1347.5823 1364.2166 1449.9786 1453.9182 1460.3860 1462.9076 1468.2204 1481.2143 2208.3551 2965.3774 2980.8990 2985.6573 2994.5148 2999.1403 3015.9662 3031.8826 3051.5734 3073.0095 3109.4849 3128.3358
redmass: 9.0097 3.9233 4.0263 3.8421 2.3016 2.9783 2.3137 1.2271 2.4045 4.7794 3.5310 12.1490 11.2415 3.1050 3.9923 6.8673 5.4901 1.1392 1.4280 1.7053 1.7915 1.3391 1.3388 1.5093 2.3883 2.9018 3.4955 1.6256 1.1771 1.2386 1.2048 1.0892 1.2288 1.2826 1.1654 1.4428 1.0534 1.0889 1.0701 1.0589 1.0781 1.0934 12.2108 1.0577 1.0611 1.0602 1.0556 1.0310 1.1010 1.0994 1.1055 1.1074 1.1056 1.1021
irintensity: 0.2014 3.1573 0.8015 1.1950 0.8297 1.0946 3.5402 1.1130 1.5356 0.8839 5.2632 0.0704 1.0895 6.1450 14.4919 1.6620 3.1174 15.4839 3.0722 1.1195 3.2567 9.4501 9.7803 3.3979 1.0773 0.6168 2.1951 0.4572 3.4618 4.8030 11.2639 0.2992 10.6964 32.6587 8.8533 24.9600 16.2409 4.9417 6.5424 8.3771 27.9405 12.3464 904.2215 43.0502 11.8769 7.5996 75.8494 26.5278 29.2639 6.8832 7.9181 79.3898 23.3994 11.6313
temp: 298.150 k
press: 1.00000 atm
elementType: 16 16 7 6 6 6 6 6 6 1 1 1 1 1 1 1 1 1 1 1
symmnumber: 1
zpe: 420423.3 jmol-1
zpe.correction: 0.160131 hartree
zpe.thermalcorrener: 0.172359 hartree
zpe.thermalcorrenthalpy: 0.173303 hartree
zpe.thermalcorrgfe: 0.117773 hartree
zpe.sumelectzpe: -1085.382427 hartree
zpe.sumelectthermal: -1085.370199 hartree
zpe.sumelectthermalent: -1085.369255 hartree
zpe.sumelectthermalfe: -1085.424785 hartree
dipole: 3.1831 4.3939 1.0457
dipole: 5.5256
quadrupole: -77.6146 -67.5613 -70.3118
quadrupole: -6.4462 5.5190 -1.0985
quadrupole: -5.7854 4.2679 1.5175 -6.4462 5.5190 -1.0985
hfenergy: -1085.5425581 hartree
pointgroup: C01 [X(C6H11N1S2)]
dipole: -1.0971128 1.8682806 0.1784168 debye
dipolederiv: -0.2445988 -0.0300426 0.0200614 -0.0801123 -0.0801308 -0.0917528 0.0286133 -0.0749687 -0.1312334 -0.4091693 0.3390229 0.1518339 0.4691718 -0.6521242 -0.2405282 0.2226668 -0.2533066 -0.2274693 -0.9130786 0.7781484 0.3277174 0.9433997 -1.3461978 -0.5214 0.3802198 -0.5148151 -0.4077697 -0.0396448 0.0063968 -0.0475028 -0.1594945 -0.0139734 0.0097639 0.0354843 0.0919268 0.1338411 -0.0145051 -0.0490358 -0.0254079 0.0773768 0.0813888 -0.0090191 -0.0538511 -0.0665182 0.1062579 0.190685 0.1349114 -0.0989144 0.1466317 0.215019 0.0287777 -0.0810364 0.0182613 0.1218591 0.5149028 -0.2952253 -0.1374254 -0.4304815 0.7169052 0.1913823 -0.150879 0.2044522 0.4073074 0.1273621 -0.0771965 0.06248 -0.0736288 -0.000417 0.0450906 0.0614598 0.0287333 0.0755562 0.7398034 -0.9390335 -0.4293092 -1.1856138 1.4500585 0.6749124 -0.5404197 0.6747671 0.2745664 0.0705429 0.042142 0.0208769 0.0940528 -0.0826665 -0.0460612 0.0256414 -0.051545 0.0557954 0.0744295 -0.0222565 -0.0044259 0.0037554 0.061354 0.0170677 -0.0173397 0.0147986 -0.1500701 -0.0197791 0.1331714 0.0444855 0.0598137 -0.1309109 -0.0666033 0.0284628 -0.0828134 0.0567094 0.0535988 -0.0179963 -0.0065581 -0.0363876 0.0798982 0.0059416 -0.0002525 0.0552891 -0.1474857 0.0098246 -0.0481983 0.0190355 -0.0602496 0.0148842 0.041094 0.0164414 0.0545977 -0.1575618 -0.0312381 0.0293225 0.0288157 0.0184497 -0.1723409 -0.0306715 0.041468 -0.0380281 0.0527628 0.0382117 0.0880219 0.0475497 0.1024825 0.000335 0.0098306 0.039416 -0.0792239 -0.1494942 -0.0846347 -0.0645185 0.0398889 0.0031887 -0.1657057 -0.0403908 0.0560263 0.0246889 0.0836602 -0.0606125 -0.0988644 0.0097357 -0.1023068 0.0198253 0.036577 0.0038515 0.0372191 0.1105972 0.0114027 0.0197367 -0.0012829 0.0586173 0.0988145 0.0450038 -0.0610619 0.0136236 -0.1610958 -0.0135025 0.0714938 -0.021654 0.1513348 -0.0940156 -0.0590144 -0.0349112 -0.0571389 0.0532668 unknown
polarizability: 128.685617|-19.1043795|111.8227904|-8.8366236|13.6532514|73.4659251 unknown
InChI: InChI=1S/C6H11NS2/c1-9-5-3-2-4-7-6-8/h2-5H2,1H3
charge 0 multiplicity 1
20 atoms
S  -3.268874 -1.028221 0.435242
S  3.683471 -2.03813 -0.968926
N  2.278277 0.208252 0.063128
C  -0.779121 0.271438 0.422945
C  0.129133 1.454253 0.016769
C  -2.20504 0.432197 -0.132579
C  1.570672 1.338819 0.576902
C  -4.889014 -0.539208 -0.386968
C  2.875062 -0.745251 -0.37018
H  -0.344947 -0.677123 0.053518
H  -0.82063 0.198804 1.528191
H  -0.293011 2.404759 0.400248
H  0.176609 1.539836 -1.086002
H  -2.198977 0.446978 -1.237896
H  -2.673329 1.363289 0.236937
H  1.532795 1.265567 1.682899
H  2.13921 2.257525 0.329079
H  -5.620472 -1.32164 -0.131195
H  -4.768463 -0.494092 -1.481629
H  -5.240551 0.431648 -0.000983
