program: Gaussian 09
title: 000078146
version: EM64L-G09RevD.01
frameworkgroup: C1[X(C4H5N3O2)]
method: RPBEPBE
basis: SDD
operation: Freq
keyword: #pfreq=noraman
keyword: PBEPBE/SDD
title: #p freq=noraman PBEPBE/SDD
converged: NO NO NO NO
title: Mulliken charges:
elementType: O O N N N C C C C H H H H H
charge: -0.215236 -0.203757 -0.401967 -0.048076 -0.606576 -0.582788 0.192391 0.045027 0.216181 0.291421 0.292135 0.331496 0.324455 0.365292
chargesum: 0.00000
title: Mulliken charges with hydrogens summed into heavy atoms:
elementType: O O N N N C C C C
charge: -0.215236 -0.203757 -0.070471 -0.048076 0.083172 0.000769 0.192391 0.045027 0.216181
polarizability: 9.45895108e+01 -6.01312800e+00 8.45430602e+01 -3.52399407e-02 -4.47110211e-03 3.42196706e+01
1716.lowfreq: -29.1777 -3.6082 -0.0010 -0.0008 -0.0007 14.6784 16.2943 131.3981 180.9381
frequency: -29.0246 131.3941 180.9338 323.6074 343.3601 363.3866 470.6070 477.5559 481.3856 572.0814 577.0137 596.2055 613.1923 691.1158 704.1268 844.9052 886.0300 929.2029 989.4267 1060.8943 1175.6977 1221.7275 1271.7922 1277.6085 1319.4998 1405.0870 1452.6353 1568.7023 1601.4972 1648.0916 1656.7036 3014.3339 3063.9008 3510.1452 3539.9729 3693.5728
redmass: 2.6365 6.2530 6.0787 3.6876 1.1124 11.7977 2.2891 7.0242 5.8701 1.5519 4.2619 1.7028 8.3541 1.5339 7.1289 4.1622 3.6821 3.0554 2.8164 2.4634 1.1550 6.2837 2.2016 2.8383 1.7032 1.0826 3.9478 4.6045 1.7416 4.6533 4.4357 1.0620 1.0975 1.0772 1.0457 1.1053
irintensity: 14.6732 3.9453 6.4932 0.9510 52.6742 11.9442 9.3799 5.0523 11.9040 242.7095 3.0645 23.0265 2.3722 104.9569 26.4385 9.0460 2.1773 17.4078 12.2048 27.1426 0.1035 17.9614 83.8555 207.9798 97.1871 23.8121 215.3949 737.9235 222.2638 477.7511 78.0774 0.7343 0.0061 24.4385 115.9212 47.8420
temp: 298.150 k
press: 1.00000 atm
elementType: 8 8 7 7 7 6 6 6 6 1 1 1 1 1
symmnumber: 1
zpe: 261129.2 jmol-1
zpe.correction: 0.099459 hartree
zpe.thermalcorrener: 0.106617 hartree
zpe.thermalcorrenthalpy: 0.107561 hartree
zpe.thermalcorrgfe: 0.067770 hartree
zpe.sumelectzpe: -469.485286 hartree
zpe.sumelectthermal: -469.478128 hartree
zpe.sumelectthermalent: -469.477184 hartree
zpe.sumelectthermalfe: -469.516974 hartree
dipole: -5.7763 3.3965 0.0782
dipole: 6.7013
quadrupole: -38.1086 -70.8398 -51.2967
quadrupole: -3.1269 0.1189 -0.0567
quadrupole: 15.3064 -17.4247 2.1183 -3.1269 0.1189 -0.0567
hfenergy: -469.5847446 hartree
pointgroup: C01 [X(C4H5N3O2)]
dipole: -0.9088329 -2.4747367 0.0300758 debye
dipolederiv: -1.1697086 0.2594299 -0.0056037 0.1438538 -0.5231843 -0.0008439 -0.0118424 0.0007069 -0.3586068 -0.8145047 -0.3933891 0.0075956 -0.3523561 -0.9551809 0.0047788 0.0046388 0.0015527 -0.3601503 -1.1846881 0.2871082 -0.0000111 0.7671874 -0.8913128 0.0018244 0.0007166 0.000383 -0.282819 -0.7862165 -0.344194 0.0024769 -0.5001441 -1.7398611 0.0010617 0.0041445 0.0067903 -0.302798 -0.3376569 0.2398879 -0.0016569 0.1072867 -1.5027804 0.000917 -0.0010653 -0.0018036 -0.7166302 -0.3994881 0.0230636 0.0014398 -0.0067012 -0.3185072 -0.0094859 0.005419 -0.0127312 0.0881096 1.3162689 -0.2890567 0.0125409 -0.7043126 1.1971032 0.0065116 0.0157902 0.0070825 0.2158938 1.0284508 0.0992666 -0.0170376 0.497913 1.8469973 -0.0054602 -0.0191202 -0.001926 0.1868573 1.7439453 0.2134089 0.002515 0.1100723 2.0355498 -0.0046051 0.0052415 -0.0075017 0.2825753 0.0594542 -0.0044843 0.018152 -0.0096433 0.1159321 -0.0489945 0.0283949 -0.071182 0.0476365 0.0568449 -0.0009951 -0.0192068 -0.0046994 0.1075879 0.0548505 -0.0291751 0.0771253 0.0577487 0.1294336 0.0003203 -0.0015455 0.0235586 0.1291364 -0.0019345 -0.0037668 -0.0012194 0.3511635 0.1442855 0.0118595 0.0000505 -0.0299461 0.2545799 0.0006123 -0.000074 0.0019616 0.3951733 0.2135799 -0.1022259 0.000291 -0.0420689 0.2439401 0.0007675 0.0006982 0.0007615 0.3958463 unknown
polarizability: 82.7497843|3.8634394|96.3827737|0.0329904|-0.0252503|34.2196837 unknown
InChI: InChI=1S/C4H5N3O2/c5-4-6-2(8)1-3(9)7-4/h6H,1,5H2
charge 0 multiplicity 1
14 atoms
O  -2.6900 0.648923 -0.01329
O  2.042778 1.790062 -0.014023
N  -1.011265 -0.947085 -0.006851
N  1.370148 -0.443139 -0.000159
N  0.630432 -2.645984 0.00322
C  -0.355579 1.437412 0.021943
C  -1.458608 0.392342 -0.00137
C  1.112203 0.941868 -0.003883
C  0.356434 -1.300103 -0.000463
H  -0.493676 2.066155 0.921997
H  -0.507932 2.124037 -0.831359
H  -1.74897 -1.658267 -0.020004
H  -0.08173 -3.371542 0.007282
H  1.617565 -2.89928 0.004361
