program: Gaussian 09
title: 000078239
version: EM64L-G09RevD.01
frameworkgroup: C1[X(C22H20N2O3)]
method: RPBEPBE
basis: SDD
operation: Freq
keyword: #p
keyword: freq=noraman
keyword: PBEPBE/SDD
title: #p freq=noraman PBEPBE/SDD
converged: YES YES NO NO
title: Mulliken charges:
elementType: O O O N N C C C C C C C C C C C C C C C C C C C C C C H H H H H H H H H H H H H H H H H H H H
charge: -0.207493 -0.283031 -0.266284 -0.387484 0.020357 -0.364779 -0.278012 0.525901 0.140519 -0.358887 0.085374 0.230374 -0.419197 -0.391886 0.191621 0.416202 -0.377153 -0.355089 -0.367941 -0.361686 -0.471604 0.311125 -0.437643 -0.252440 -0.248834 -0.534468 -0.538189 0.278398 0.309362 0.265214 0.301044 0.243961 0.241637 0.244213 0.277873 0.249370 0.237956 0.240129 0.240632 0.230745 0.230103 0.257494 0.219583 0.228777 0.244781 0.222258 0.217099
chargesum: 0.00000
title: Mulliken charges with hydrogens summed into heavy atoms:
elementType: O O O N N C C C C C C C C C C C C C C C C C C C C C C
charge: -0.207493 -0.283031 -0.266284 -0.086441 0.020357 -0.086381 0.031350 0.525901 0.140519 -0.093673 0.085374 0.230374 -0.175236 -0.150249 0.191621 0.416202 -0.132939 -0.105719 -0.129985 -0.083813 -0.231475 0.311125 -0.197011 -0.021695 -0.018731 0.171386 0.145948
polarizability: 3.89716257e+02 -3.55779235e+01 2.55546392e+02 2.19647247e+00 -1.19766205e+01 1.77128785e+02
1716.lowfreq: -4.7314 -0.0009 -0.0005 0.0003 2.6340 8.4279 12.5820 13.9940 20.1060
frequency: 12.3979 13.7572 19.8403 43.2656 58.6578 62.1377 69.6950 101.3180 126.8658 128.2683 137.7923 149.1483 161.6627 188.2329 204.0630 218.8811 229.2837 244.2458 270.1350 292.7593 297.1013 311.4736 340.6824 376.5212 399.4759 404.0358 415.8957 427.2648 446.3533 461.6374 490.5887 512.0833 523.4396 528.2717 540.2373 567.9650 598.1535 621.1758 630.0422 644.0558 680.2129 697.9666 729.2625 734.4632 746.0910 759.3164 767.3401 777.1177 802.1853 815.8797 819.0691 826.7354 836.5288 845.2319 873.6038 876.4630 880.9001 925.5428 945.9982 951.0741 958.8288 968.4419 971.9903 975.3939 989.3656 994.2658 1001.8162 1012.2958 1026.1666 1049.1298 1077.8634 1102.8972 1110.3844 1112.1343 1112.4544 1145.9213 1155.9260 1162.1250 1177.3338 1180.7270 1187.1869 1209.7811 1223.9744 1226.8088 1229.5718 1231.8166 1241.4880 1258.7315 1280.7686 1287.9927 1308.0833 1327.3869 1353.3143 1376.4408 1385.2546 1398.9724 1410.4930 1419.7774 1431.5655 1436.0260 1436.4980 1458.9621 1465.7156 1470.9611 1473.0141 1474.7902 1501.6887 1514.1622 1544.2605 1572.4306 1583.4109 1587.7576 1598.5118 1622.4783 1630.3373 2956.7215 2957.7760 2967.5276 3040.3494 3043.4244 3060.3348 3121.2605 3121.5668 3123.5321 3128.7074 3129.0729 3130.4842 3138.1828 3158.6234 3159.2543 3165.3685 3167.9219 3183.7155 3198.7507 3560.7693
redmass: 5.6557 5.4860 3.5984 6.5739 4.6911 4.4160 3.2781 3.9900 5.4179 4.7730 5.0451 5.9140 4.1114 3.2456 2.5550 4.5119 1.4071 1.4079 3.1487 3.9944 6.0232 4.9080 5.0930 5.4004 4.7000 4.1166 2.9753 3.2888 3.5353 3.1483 2.4670 3.8595 6.0455 3.5735 2.5029 4.5749 4.6560 6.0223 6.6606 4.5613 5.0119 5.1040 3.2984 4.2043 5.2188 1.3102 3.7065 1.6597 3.5162 1.4305 1.5643 4.2851 1.6388 4.6571 5.1300 4.2935 1.6746 3.7854 1.5039 1.3467 3.9750 1.4164 1.4248 2.8007 7.4746 1.3442 3.4454 4.0832 3.2477 3.6078 3.6662 2.4614 1.3663 1.2717 1.2624 1.4061 1.3441 1.3738 1.2394 1.1262 1.5091 1.8405 1.4567 2.5704 1.7096 1.7444 2.4778 1.3429 1.7398 1.7537 1.3968 1.7282 3.4476 1.3269 4.1982 3.0648 4.0215 3.0782 3.5451 1.1742 1.2762 1.8473 1.0503 1.0518 1.0757 1.1273 2.4720 3.5718 6.1132 8.2286 7.3568 8.2360 6.3315 6.3835 6.6041 1.0332 1.0814 1.0325 1.0860 1.1037 1.1044 1.0901 1.0872 1.0982 1.0896 1.0937 1.0953 1.0901 1.0935 1.0973 1.0954 1.0943 1.0957 1.0951 1.0794
irintensity: 0.2723 0.2412 0.5576 0.7383 0.1658 1.7503 3.1915 4.6326 0.8496 2.7269 2.1882 2.2986 0.2847 1.4807 2.7024 9.9871 0.4344 0.5010 0.9537 0.5139 1.8446 0.8078 0.5141 0.2617 8.1868 9.6690 0.2721 37.5355 30.6514 33.4125 110.6439 13.2848 4.3635 1.9855 26.0426 6.7567 15.4971 16.3591 6.4004 6.4391 4.5625 0.5879 6.6482 1.1369 7.8279 34.3530 36.7777 21.5420 12.9985 27.7263 84.5237 5.5345 49.8121 9.2326 13.7187 8.8469 3.2392 5.0465 2.4315 0.3831 6.3870 4.4883 3.6315 16.9214 60.7675 0.2116 31.0163 16.0323 41.5663 51.4431 20.0880 26.0032 15.4532 2.1558 0.6250 1.3837 0.4227 21.3805 75.3681 2.4157 33.6590 22.7971 59.4296 255.8153 41.4447 99.2496 61.7289 7.4585 22.0990 1.7686 6.0900 12.7137 61.8727 27.3704 7.1024 14.3593 6.3945 0.6042 25.3849 9.1192 0.6700 33.1364 13.1331 10.4046 61.4922 28.1497 135.1482 89.0143 21.9191 12.7973 13.9725 84.8049 51.0763 43.4272 44.9525 72.5000 11.8513 68.5879 7.5068 50.4984 35.3361 22.5977 2.2258 15.9225 10.8807 18.0939 2.9479 17.5189 16.6162 34.5952 6.0641 14.3507 7.2387 2.2072 18.5720
temp: 298.150 k
press: 1.00000 atm
elementType: 8 8 8 7 7 6 6 6 6 6 6 6 6 6 6 6 6 6 6 6 6 6 6 6 6 6 6 1 1 1 1 1 1 1 1 1 1 1 1 1 1 1 1 1 1 1 1
symmnumber: 1
zpe: 966098.5 jmol-1
zpe.correction: 0.367968 hartree
zpe.thermalcorrener: 0.391899 hartree
zpe.thermalcorrenthalpy: 0.392844 hartree
zpe.thermalcorrgfe: 0.311387 hartree
zpe.sumelectzpe: -1183.543251 hartree
zpe.sumelectthermal: -1183.519319 hartree
zpe.sumelectthermalent: -1183.518375 hartree
zpe.sumelectthermalfe: -1183.599831 hartree
dipole: -0.8514 5.6606 -3.4275
dipole: 6.6720
quadrupole: -127.5320 -149.4004 -160.6013
quadrupole: 1.5030 6.3632 -8.7447
quadrupole: 18.3126 -3.5558 -14.7568 1.5030 6.3632 -8.7447
hfenergy: -1183.911218 hartree
pointgroup: C01 [X(C22H20N2O3)]
dipole: 0.2473116 -2.54973 -0.5728424 debye
polarizability: 388.2453052|-38.3579053|256.6036611|0.6661388|-13.0518628|177.5424679 unknown
InChI: InChI=1S/C22H20N2O3/c1-26-16-10-7-15(8-11-16)18-13-23-24-21(18)22(25)20-17-6-4-3-5-14(17)9-12-19(20)27-2/h3-13,18,21,24H,1-2H3
charge 0 multiplicity 1
47 atoms
O  -0.984116 1.817709 1.211204
O  -0.276675 -1.845446 0.523565
O  6.252323 -1.022022 0.690163
N  -0.54422 1.420012 -1.930568
N  0.262085 2.408174 -2.520424
C  1.329848 1.763626 -0.470184
C  0.115258 0.803652 -0.724965
C  2.650055 1.050222 -0.206069
C  -0.948804 0.851281 0.399563
C  1.29616 2.625825 -1.730336
C  -2.014314 -0.210777 0.382365
C  -3.415896 0.147602 0.359193
C  3.097586 0.836801 1.125407
C  3.444535 0.548665 -1.264516
C  -1.651501 -1.576193 0.419888
C  -4.41573 -0.904187 0.343336
C  -2.6399 -2.609319 0.409728
C  4.292658 0.144815 1.39187
C  4.651878 -0.144571 -1.018636
C  -3.867846 1.511102 0.320215
C  -3.991135 -2.269704 0.368931
C  5.07564 -0.348597 0.317972
C  -5.808058 -0.562882 0.299877
C  -5.23111 1.810695 0.276864
C  -6.214223 0.770898 0.269858
C  0.168361 -3.238464 0.633486
C  7.113131 -1.518669 -0.384678
H  1.070251 2.38668 0.412183
H  0.433518 -0.23576 -0.91161
H  2.016447 3.408462 -1.973707
H  -1.079409 0.849872 -2.587222
H  2.497948 1.217497 1.961028
H  3.119568 0.709193 -2.300049
H  -2.34248 -3.660927 0.44578
H  -3.13237 2.318513 0.334465
H  4.643108 -0.019982 2.415398
H  5.245262 -0.510756 -1.862136
H  -4.750873 -3.060232 0.363051
H  -6.548374 -1.371864 0.288497
H  -5.553821 2.857243 0.248836
H  -7.278571 1.027199 0.237343
H  1.263102 -3.174813 0.715221
H  -0.106826 -3.825244 -0.263872
H  -0.246576 -3.718286 1.539878
H  7.9670 -1.989233 0.124607
H  7.472177 -0.692082 -1.0286
H  6.589929 -2.27093 -1.007505
