program: Gaussian 09
title: 000078171
version: EM64L-G09RevD.01
frameworkgroup: C1[X(C14H18N2O3)]
method: RPBEPBE
basis: SDD
operation: Freq
keyword: #p
keyword: freq=noraman
keyword: PBEPBE/SDD
title: #p freq=noraman PBEPBE/SDD
converged: YES YES NO NO
title: Mulliken charges:
elementType: O O O N N C C C C C C C C C C C C C C H H H H H H H H H H H H H H H H H H
charge: -0.244320 -0.266021 -0.252121 -0.191735 -0.453258 -0.359818 -0.371130 -0.308896 -0.324732 0.486246 -0.384171 -0.354382 0.489826 -0.368010 -0.486868 0.172795 -0.623396 0.281687 -0.766781 0.213019 0.220272 0.212189 0.220874 0.217530 0.194201 0.193266 0.219435 0.218726 0.234962 0.302870 0.229381 0.359247 0.269556 0.263345 0.250732 0.260932 0.244548
chargesum: 0.00000
title: Mulliken charges with hydrogens summed into heavy atoms:
elementType: O O O N N C C C C C C C C C C C C C C
charge: -0.244320 -0.266021 -0.252121 -0.191735 -0.094011 0.073473 0.061933 0.102834 0.087969 0.486246 -0.165445 -0.119420 0.489826 -0.065139 -0.257487 0.172795 -0.090496 0.281687 -0.010570
polarizability: 3.07340877e+02 -9.93009407e+00 1.71029801e+02 -1.97908131e+00 5.72299054e+00 1.01693341e+02
1716.lowfreq: -8.2539 -7.4092 -0.0006 -0.0003 0.0005 1.8570 17.8378 34.1022 43.7302
frequency: 17.6499 34.0602 43.7265 52.5315 68.5237 80.8627 92.6409 123.8825 145.0784 174.2115 203.1976 223.6871 255.4626 261.5990 309.2727 348.4331 370.3470 375.4483 394.0525 412.0072 441.7139 450.3863 459.4996 488.3694 527.9276 550.2002 567.9618 596.2630 633.6745 661.4628 724.3919 727.0163 796.6959 806.5095 814.7704 827.8227 835.3654 843.1535 873.7851 894.0494 909.5766 916.3925 930.7098 934.5015 978.8966 979.6828 999.6292 1021.1681 1021.8625 1043.3148 1054.4135 1082.6003 1103.3090 1130.5851 1159.6642 1172.0025 1177.3866 1196.8555 1199.7053 1215.1724 1230.4619 1257.6812 1276.2286 1283.8764 1307.2430 1318.3243 1335.1348 1346.3536 1355.3464 1366.8168 1372.3785 1372.9463 1377.3171 1417.6176 1432.0508 1440.5987 1445.2380 1451.4934 1451.9276 1452.7147 1462.8136 1513.6078 1538.3458 1586.5750 1601.3607 1633.7458 1639.5955 2901.6072 2916.7135 2951.7270 2956.5588 2971.7018 2981.7707 3046.4345 3064.2935 3081.4693 3082.3770 3082.6508 3085.9214 3118.7387 3127.4234 3143.7421 3163.6499 3189.0549 3307.6279
redmass: 3.3666 4.0921 4.0629 4.5387 4.0671 3.8173 4.0271 5.8587 1.1842 5.4365 4.7693 2.2392 3.3766 3.3433 3.9661 6.7588 4.2015 2.4107 3.5018 3.0287 3.5705 2.7675 2.7736 4.4646 2.5544 3.4463 3.2033 3.2456 6.9259 3.0797 4.1118 3.9798 1.5996 2.7873 1.9991 2.5716 2.0487 1.6145 1.5021 2.0054 3.2058 2.7318 4.6356 1.4075 1.3898 1.8177 2.6449 1.8240 2.2705 2.2663 1.9715 4.4524 2.1670 1.4728 1.4893 2.9926 1.9314 1.2808 1.1345 2.2483 1.4810 1.3145 2.1587 1.2137 1.7931 1.4285 1.3376 1.3125 2.1047 1.5056 1.5889 2.3245 1.2964 1.0984 3.7178 1.0743 1.0841 1.0564 1.0905 1.0979 1.1099 2.6703 2.7633 3.9490 7.2826 5.8885 3.5207 1.0694 1.0713 1.0670 1.0668 1.0671 1.0386 1.0907 1.0952 1.0961 1.0911 1.0912 1.0958 1.0896 1.1003 1.0893 1.0930 1.0948 1.0805
irintensity: 1.4380 0.2644 1.2192 3.4751 3.3053 11.3384 2.5892 6.5572 1.1944 1.9212 5.0250 0.7148 6.3952 39.8364 0.8300 8.0108 0.5356 2.4958 1.8677 1.6189 2.0705 2.2987 1.5247 7.9011 22.6472 35.7582 15.5518 6.1110 1.7015 11.8399 2.0066 1.8917 4.9251 6.4454 18.5029 40.0050 4.9349 8.1817 69.5139 12.7532 68.1554 37.9504 0.1262 11.7213 4.6412 13.4274 1.5020 14.4455 20.1735 8.6854 16.0705 47.7622 13.0050 12.0999 23.6703 19.7643 6.9159 69.0728 2.0073 154.2985 149.6122 44.7126 31.6345 7.8909 105.2697 14.2281 4.5819 10.5886 24.7216 31.3681 92.9734 17.6768 17.9961 49.0440 3.4403 21.3747 3.1769 21.0987 6.9107 28.1787 52.7432 252.7123 371.7397 227.9833 111.8501 49.9406 183.5379 71.6174 88.6285 30.6776 111.8353 3.5393 1.5268 27.7977 8.5731 37.2218 9.9812 25.2443 37.8430 18.4897 11.3358 21.0127 15.3759 4.7980 296.2529
temp: 298.150 k
press: 1.00000 atm
elementType: 8 8 8 7 7 6 6 6 6 6 6 6 6 6 6 6 6 6 6 1 1 1 1 1 1 1 1 1 1 1 1 1 1 1 1 1 1
symmnumber: 1
zpe: 790590.3 jmol-1
zpe.correction: 0.301120 hartree
zpe.thermalcorrener: 0.319367 hartree
zpe.thermalcorrenthalpy: 0.320311 hartree
zpe.thermalcorrgfe: 0.252454 hartree
zpe.sumelectzpe: -878.036181 hartree
zpe.sumelectthermal: -878.017934 hartree
zpe.sumelectthermalent: -878.016989 hartree
zpe.sumelectthermalfe: -878.084847 hartree
dipole: -2.6844 -1.4686 -0.0989
dipole: 3.0615
quadrupole: -89.3596 -115.0847 -113.4334
quadrupole: 3.5622 2.5241 -1.7851
quadrupole: 16.5996 -9.1255 -7.4742 3.5622 2.5241 -1.7851
hfenergy: -878.337301 hartree
pointgroup: C01 [X(C14H18N2O3)]
dipole: 1.0365603 -0.5708349 -0.2246669 debye
polarizability: 307.12914|-0.1594413|156.5368935|13.4008698|28.1236478|116.3979856 unknown
InChI: InChI=1S/C14H18N2O3/c1-11(17)10-14(18)15-12-2-4-13(5-3-12)16-6-8-19-9-7-16/h2-5,15H,6-10H2,1H3
charge 0 multiplicity 1
37 atoms
O  -6.155393 0.057534 -0.231083
O  3.082023 1.798578 1.236119
O  4.508939 -1.895008 -0.442493
N  -3.253929 0.078893 -0.151296
N  2.424285 -0.316579 0.425177
C  -4.060673 0.769259 0.887067
C  -3.983799 -1.037301 -0.786764
C  -5.418668 1.207662 0.317297
C  -5.354303 -0.557455 -1.299318
C  -1.846438 -0.024665 0.021833
C  -1.087248 1.074333 0.523645
C  -1.126385 -1.204014 -0.333645
C  1.011747 -0.168569 0.304888
C  0.309225 1.011707 0.669588
C  0.273294 -1.267338 -0.201381
C  3.343696 0.613624 0.860357
C  4.809271 0.108696 0.932933
C  5.27515 -0.963271 -0.052305
C  6.709338 -0.870299 -0.535798
H  -3.522948 1.655893 1.258642
H  -4.233011 0.089594 1.753512
H  -4.127982 -1.887267 -0.078407
H  -3.405939 -1.406664 -1.652851
H  -6.06248 1.621093 1.11082
H  -5.267286 1.969013 -0.478587
H  -5.204647 0.176288 -2.121211
H  -5.951556 -1.40806 -1.667151
H  -1.586802 2.013617 0.781442
H  -1.652694 -2.090688 -0.697334
H  0.867928 1.869909 1.048062
H  0.796223 -2.19018 -0.483039
H  2.835525 -1.212075 0.106973
H  4.952698 -0.30758 1.95381
H  5.454948 1.000419 0.874558
H  6.815365 0.003714 -1.207987
H  6.992117 -1.781698 -1.084034
H  7.401708 -0.705217 0.31036
