program: Gaussian 09
title: 000078110
version: EM64L-G09RevD.01
frameworkgroup: C1[X(C4H7Br)]
method: RPBEPBE
basis: SDD
operation: Freq
keyword: #pfreq=noraman
keyword: PBEPBE/SDD
title: #p freq=noraman PBEPBE/SDD
converged: YES YES NO YES
title: Mulliken charges:
elementType: Br C C C C H H H H H H H
charge: -0.062051 -0.433047 -0.391498 -0.391497 -0.446135 0.300401 0.240049 0.242042 0.242042 0.240048 0.236913 0.222733
chargesum: 0.00000
title: Mulliken charges with hydrogens summed into heavy atoms:
elementType: Br C C C C
charge: -0.062051 -0.132646 0.090593 0.090593 0.013511
polarizability: 7.98573031e+01 -1.34975626e-05 4.46892100e+01 -4.05564474e+00 4.75067769e-06 4.11802538e+01
1716.lowfreq: -10.1333 -0.0003 0.0002 0.0006 8.3301 15.7003 136.9781 236.8635 278.1683
frequency: 136.9779 236.8629 278.1682 461.4342 698.9835 781.0056 798.1506 902.6315 913.6560 938.7075 1019.9698 1035.2911 1084.7985 1162.7550 1190.5876 1212.1376 1228.7187 1234.0326 1253.8855 1257.9517 1451.4472 1460.8244 1474.9391 3030.2811 3035.0265 3040.9791 3081.6389 3100.3607 3109.8672 3126.3421
redmass: 2.2076 3.2901 4.1951 2.3366 1.9215 1.1724 1.9166 2.1697 3.0317 1.2406 2.6854 2.1462 2.0167 1.2877 1.3422 1.0937 1.3271 1.3292 1.3388 1.4221 1.0866 1.0832 1.1185 1.0565 1.0583 1.0640 1.0926 1.1063 1.1080 1.1065
irintensity: 0.6132 0.1396 6.9070 6.3062 28.3225 2.5114 42.9044 1.9282 0.9466 5.5553 14.7816 1.6776 2.2852 3.1031 8.9051 1.0282 8.8493 0.0564 52.8013 3.5850 11.5524 6.4717 2.5017 30.8529 50.6461 13.6740 3.8596 3.0604 15.7158 64.0454
temp: 298.150 k
press: 1.00000 atm
elementType: 35 6 6 6 6 1 1 1 1 1 1 1
symmnumber: 1
zpe: 261613.8 jmol-1
zpe.correction: 0.099643 hartree
zpe.thermalcorrener: 0.104996 hartree
zpe.thermalcorrenthalpy: 0.105941 hartree
zpe.thermalcorrgfe: 0.069655 hartree
zpe.sumelectzpe: -169.652460 hartree
zpe.sumelectthermal: -169.647107 hartree
zpe.sumelectthermalent: -169.646163 hartree
zpe.sumelectthermalfe: -169.682449 hartree
dipole: -2.8583 0.0000 0.3384
dipole: 2.8783
quadrupole: -40.2059 -40.5076 -39.0287
quadrupole: 0.0000 -0.7982 0.0000
quadrupole: -0.2919 -0.5935 0.8854 0.0000 -0.7982 0.0000
hfenergy: -169.7521039 hartree
pointgroup: C01 [X(C4H7Br1)]
dipole: 1.1148457 -0.0000765 0.1985979 debye
dipolederiv: -0.7598807 0.0000423 -0.0409816 0.0000355 -0.1893171 0.0000032 -0.1775718 0.0000139 -0.1890641 1.1525835 -0.0000768 0.1707289 -0.000073 0.0613421 -0.0000064 0.2261099 -0.0000111 0.1864445 -0.173847 -0.0413444 0.0421587 0.1261683 0.0509829 0.116329 -0.0331081 0.0437444 0.0867417 -0.1738594 0.0413834 0.042136 -0.1261377 0.05098 -0.1163316 -0.0331021 -0.0437348 0.0867588 -0.047023 -0.0000032 -0.0496357 0.0000063 -0.0627297 0.0000171 0.1284558 0.0000035 0.194812 -0.0727875 0.0000083 -0.0571725 0.000011 0.0691943 -0.0000053 0.0010199 -0.0000097 -0.1172857 0.0283223 -0.0173002 -0.0061702 -0.0327235 -0.1228172 -0.0922223 -0.0128834 -0.1285029 0.0224947 0.0842075 0.0357574 -0.053254 0.0114165 0.05898 0.0322766 -0.0376887 0.0696946 -0.081485 0.0842001 -0.0357665 -0.0532548 -0.0114243 0.0589764 -0.0322841 -0.037698 -0.0697043 -0.0814749 0.0283296 0.0172766 -0.0061576 0.0326992 -0.1228023 0.0922388 -0.0128669 0.1285202 0.0224715 -0.1145002 0.0000199 0.097336 0.0000218 0.0796792 -0.0000135 0.1364326 -0.0000168 -0.039961 -0.0357453 0.0000032 -0.0857332 0. 0.0675313 -0.0000017 -0.1470991 0.0000029 -0.0904525 unknown
polarizability: 79.2524504|-0.0023735|44.6892102|6.2830183|-0.0006479|41.7851063 unknown
InChI: InChI=1S/C4H7Br/c5-4-2-1-3-4/h4H,1-3H2
charge 0 multiplicity 1
12 atoms
Br -2.326521 0.00019 -0.234957
C  -0.412814 0.000076 0.452286
C  0.545346 1.102604 -0.077394
C  0.545177 -1.102654 -0.077278
C  1.670073 -0.000113 -0.101768
H  -0.528451 0.000142 1.547257
H  0.687108 1.98913 0.560347
H  0.273959 1.42248 -1.096858
H  0.273743 -1.422598 -1.096709
H  0.686802 -1.989136 0.560555
H  2.33914 -0.000209 -0.9762
H  2.275738 -0.000111 0.819917
