program: Gaussian 09
title: 000078112
version: EM64L-G09RevD.01
frameworkgroup: C1[X(C7H10N2O2)]
method: RPBEPBE
basis: SDD
operation: Freq
keyword: #p
keyword: freq=noraman
keyword: PBEPBE/SDD
title: #p freq=noraman PBEPBE/SDD
converged: NO YES NO NO
title: Mulliken charges:
elementType: O O N N C C C C C C C H H H H H H H H H H
charge: -0.275442 -0.259324 -0.211748 -0.150812 0.276029 0.239481 0.139367 -0.267306 -0.602626 -0.621927 -0.761517 0.257088 0.249785 0.270879 0.249525 0.287583 0.239423 0.239306 0.248000 0.206253 0.247984
chargesum: 0.00000
title: Mulliken charges with hydrogens summed into heavy atoms:
elementType: O O N N C C C C C C C
charge: -0.275442 -0.259324 -0.211748 -0.150812 0.276029 0.239481 0.139367 -0.010218 0.167563 0.144385 -0.059280
polarizability: 1.26882211e+02 3.36599256e+00 1.07289803e+02 -2.20655171e-03 3.08274866e-02 5.37537168e+01
1716.lowfreq: -12.9563 -6.5758 -0.0009 0.0001 0.0004 8.2509 86.4790 100.0673 106.2600
frequency: 86.4783 100.0650 106.2462 116.7935 127.0569 164.9862 262.3294 267.1182 306.5556 328.0401 363.7947 392.2833 439.4175 443.0247 489.9200 556.3223 641.7088 709.2450 741.9728 753.7382 888.7950 890.0651 952.0736 1026.5516 1042.9907 1050.0058 1071.0878 1127.7519 1130.4434 1177.5985 1242.7762 1258.6940 1314.7597 1355.3277 1386.1134 1406.9126 1429.2356 1430.1136 1448.1869 1473.5414 1475.5557 1476.2988 1481.3493 1493.7198 1577.3556 1629.7667 1665.1616 2987.2780 2995.1701 3012.6731 3068.8452 3084.1184 3094.5755 3104.5602 3128.7377 3140.9082 3157.4564
redmass: 2.8315 1.1506 1.2885 1.6863 1.4266 2.8889 2.6766 4.4398 2.7638 4.3581 3.8809 9.0733 6.4032 3.4712 8.5349 4.6393 3.8838 9.8665 7.6650 7.1985 3.4881 1.3467 3.2201 2.0113 2.3142 1.4560 2.1527 1.2942 1.3129 2.0087 2.7470 8.0392 4.4974 1.7446 2.2568 1.2911 1.3972 1.3207 1.0437 1.0823 1.0587 1.0516 1.1536 1.0438 8.9549 8.9637 6.6131 1.0360 1.0345 1.0328 1.0975 1.1033 1.1006 1.1021 1.0990 1.1023 1.0939
irintensity: 0.0851 0.2502 2.2577 4.3879 7.3340 3.0429 3.2578 0.0023 2.6860 0.0214 7.3667 26.2563 19.2663 0.6248 5.5182 1.6835 0.5282 2.9610 22.1480 5.4730 2.9261 18.1427 7.2530 5.5397 27.1576 6.8643 29.7496 0.5202 0.0050 21.6385 1.9966 20.0168 94.3461 22.6866 28.5052 11.1849 81.4410 102.5042 13.0276 8.2276 9.1767 10.2213 70.1816 18.8079 435.9349 213.8480 212.7837 25.7629 59.1687 22.1332 13.8736 24.7668 17.1674 17.3143 0.0875 0.8755 7.3129
temp: 298.150 k
press: 1.00000 atm
elementType: 8 8 7 7 6 6 6 6 6 6 6 1 1 1 1 1 1 1 1 1 1
symmnumber: 1
zpe: 437077.5 jmol-1
zpe.correction: 0.166474 hartree
zpe.thermalcorrener: 0.177779 hartree
zpe.thermalcorrenthalpy: 0.178724 hartree
zpe.thermalcorrgfe: 0.129561 hartree
zpe.sumelectzpe: -531.896626 hartree
zpe.sumelectthermal: -531.885321 hartree
zpe.sumelectthermalent: -531.884376 hartree
zpe.sumelectthermalfe: -531.933539 hartree
dipole: -1.0690 -4.2085 -0.0007
dipole: 4.3422
quadrupole: -75.3907 -56.3468 -64.8919
quadrupole: 1.3433 0.0022 -0.0042
quadrupole: -9.8476 9.1963 0.6513 1.3433 0.0022 -0.0042
hfenergy: -532.0631 hartree
pointgroup: C01 [X(C7H10N2O2)]
dipole: -0.389977 -1.6632336 0.0001662 debye
dipolederiv: -1.2031562 0.2761566 -0.0001174 0.3761196 -0.6701559 0.0000791 0.0003631 -0.0002114 -0.3735647 -1.0552691 -0.2587417 0.0001864 -0.4374348 -0.7454918 0.000063 -0.0002206 0.0003198 -0.3572378 -1.2416736 -0.0440121 0.0000195 0.0005454 -0.5882412 -0.0004538 -0.0002254 0.0012498 -0.2007426 -1.1477957 -0.2335349 0.0004014 0.6669002 -0.8055663 0.0000499 -0.0005242 -0.0004928 -0.1562263 -0.1031706 -0.2287807 -0.000031 -0.5339234 -0.5089324 0.0000931 0.0003285 -0.0000628 -0.0953826 1.5414817 -0.1308781 -0.0002326 -0.470457 1.2608343 0.0001187 -0.0005875 0.0001295 0.2665934 1.4205765 0.068868 0.0001464 0.4553071 1.0355796 0.0000196 0.0001534 0.0000418 0.2169566 0.9575456 0.2175793 -0.0000716 -0.292976 0.1357094 -0.0001821 0.0003981 0.000222 -0.0735361 0.0283081 0.0293009 0.0000752 -0.0381479 0.3620762 0.0014256 0.0004009 0.0008409 0.1989194 0.3816278 0.3495324 -0.0006146 0.261969 0.2251583 -0.0000692 -0.0004549 0.0001786 0.2347425 -0.0888732 0.0531343 -0.0000099 -0.001814 0.0758551 0.0000349 -0.0000658 -0.0000274 0.060724 0.0924308 -0.0023723 0.0000151 0.0161531 -0.0654666 0.0000706 -0.0001478 0.0000704 0.1589506 0.0713513 0.0735181 -0.0938158 0.0154534 0.0297814 0.008467 -0.0640755 0.0574479 -0.037727 0.0272845 -0.1474985 0.0022427 -0.0050235 0.1320922 -0.0000701 0.0012625 -0.0000117 0.1276415 0.0737793 0.0718393 0.0914768 0.015824 0.0274433 -0.0095968 0.062724 -0.0599001 -0.0424343 0.0446638 0.0082269 -0.0001917 0.145275 0.1352581 0.0004322 -0.0001661 0.0002958 0.1340684 0.067891 -0.0322765 -0.0398742 -0.1052928 -0.0237541 0.094104 0.0332526 0.1243444 -0.0566709 0.0682504 -0.0314374 0.0403975 -0.1050212 -0.0246384 -0.0945855 -0.0323796 -0.1244294 -0.0554814 -0.000878 0.0150535 0.0777158 -0.0053783 0.0842845 0.0653516 0.1077187 0.0228547 -0.0287691 0.0664921 -0.0687371 -0.0000251 0.0472308 -0.1561091 -0.000017 -0.000009 -0.000012 0.1080691 -0.0008666 0.0150603 -0.0776927 -0.0053088 0.0842834 -0.0653348 -0.1077454 -0.0228482 -0.0288927 unknown
polarizability: 126.7515239|3.7246869|107.4205021|-0.0051339|0.016761|53.7537046 unknown
InChI: InChI=1S/C7H10N2O2/c1-5-4-8(2)7(11)9(3)6(5)10/h4H,1-3H3
charge 0 multiplicity 1
21 atoms
O  -2.419147 0.972511 -0.000565
O  2.269202 1.285595 -0.000889
N  -0.078725 1.121837 -0.001449
N  -1.151369 -1.007921 -0.000852
C  1.28257 -0.922269 -0.000616
C  -1.290352 0.401474 -0.001126
C  1.238389 0.546183 -0.000845
C  0.099703 -1.621625 -0.000521
C  -0.204424 2.597367 -0.001606
C  -2.380581 -1.829183 -0.000008
C  2.638094 -1.584423 -0.000269
H  0.081754 -2.715499 -0.000131
H  -0.768894 2.927069 -0.889006
H  0.81423 3.010743 -0.012773
H  -0.748629 2.929823 0.897548
H  -3.240739 -1.143599 -0.002675
H  -2.420989 -2.461948 0.903798
H  -2.418815 -2.466634 -0.900576
H  3.224738 -1.273915 -0.883745
H  2.550109 -2.684559 -0.000354
H  3.224277 -1.274027 0.883558
