program: Gaussian 09
title: 000078186
version: EM64L-G09RevD.01
frameworkgroup: C1[X(C23H15NO3)]
method: RPBEPBE
basis: SDD
operation: Freq
keyword: #p
keyword: freq=noraman
keyword: PBEPBE/SDD
title: #p freq=noraman PBEPBE/SDD
converged: NO YES NO NO
title: Mulliken charges:
elementType: O O O N C C C C C C C C C C C C C C C C C C C C C C C H H H H H H H H H H H H H H H
charge: -0.267184 -0.406893 -0.375090 -0.475325 0.258084 0.200919 0.155612 0.175306 0.190027 -0.462125 -0.543115 0.112117 0.136574 0.344659 -0.382304 0.200396 0.431303 -0.360373 -0.238562 -0.359467 -0.213080 -0.318258 -0.466846 -0.425064 -0.233900 -0.278456 -0.242241 0.212453 0.269290 0.246757 0.257134 0.317347 0.229991 0.318902 0.232566 0.186058 0.240850 0.241802 0.230790 0.231544 0.233293 0.394510
chargesum: 0.00000
title: Mulliken charges with hydrogens summed into heavy atoms:
elementType: O O O N C C C C C C C C C C C C C C C C C C C C C C C
charge: -0.267184 -0.012383 -0.375090 -0.157978 0.258084 0.200919 0.155612 0.175306 0.190027 -0.249672 -0.273825 0.112117 0.136574 0.344659 -0.135547 0.200396 0.431303 -0.103239 -0.008571 -0.040565 0.019486 -0.132200 -0.225996 -0.183262 -0.003110 -0.046912 -0.008948
polarizability: 5.32074487e+02 1.53017626e+01 3.23387918e+02 -5.12736493e+00 -5.67355331e-01 1.00264186e+02
1716.lowfreq: -6.8715 -2.5412 -0.0008 -0.0006 0.0004 3.9385 9.3192 25.3205 44.2316
frequency: 9.2730 25.2792 44.2284 62.1003 70.2654 116.0520 121.8522 142.4809 174.5068 176.9502 184.8353 219.6931 226.7461 268.0260 318.0190 350.5950 374.5409 386.8851 412.3815 413.3679 431.0199 434.4971 440.1784 469.8148 471.3076 501.8380 514.3288 532.4759 548.8736 553.7139 564.9198 608.6950 612.8152 626.5656 634.5300 655.2611 686.5907 705.4968 717.4015 720.1618 736.5575 750.2354 753.3820 768.9623 781.8481 783.3353 787.2515 808.6003 831.7156 839.6929 860.9141 864.0421 865.8645 868.9952 882.3849 928.3909 937.0516 945.1660 945.5570 953.3100 982.5694 988.7504 998.0167 1007.5050 1014.5230 1043.0757 1071.2578 1091.8924 1099.4913 1133.0975 1155.0039 1163.3398 1172.4880 1183.9162 1193.0283 1215.8136 1217.2607 1235.8696 1238.6123 1261.7772 1276.7461 1291.1199 1303.7660 1327.1850 1374.6840 1399.0856 1406.2815 1410.5791 1420.8434 1435.8089 1440.7971 1444.6262 1450.5196 1456.2511 1479.6517 1505.6273 1540.8839 1581.1957 1588.9413 1590.6411 1600.4800 1604.7104 1625.0143 1636.3761 1661.3075 2779.8884 3100.6561 3127.7200 3132.1189 3137.4279 3137.9346 3145.0124 3148.9053 3157.0610 3165.6262 3165.8727 3175.3653 3178.6958 3202.3458 3572.9503
redmass: 5.3072 5.4218 6.0696 5.2302 6.0517 4.0434 6.3180 5.7520 5.5558 4.3913 5.5405 6.5152 5.9693 3.7276 5.6043 7.9927 7.1786 6.8855 2.9152 5.6767 3.5839 4.6154 3.0293 7.2064 3.6922 7.0254 7.1537 7.6588 2.2947 3.8665 5.9355 4.7419 3.0955 6.7764 3.2246 2.7780 6.0881 4.4897 6.2880 6.6857 1.4123 3.3192 2.1032 1.8427 5.0588 2.2063 6.5964 1.4104 5.8005 1.8139 4.9243 1.3978 4.0886 2.0722 1.5794 1.2130 1.1677 7.6397 1.3927 1.4105 1.3154 1.3438 1.3581 3.0348 2.5769 2.4197 2.4519 2.2894 2.0007 3.5478 1.4265 1.3042 1.9316 1.1119 1.2734 2.0064 2.1735 1.8070 2.0367 2.1783 2.0365 2.2053 2.2694 2.3278 2.5984 4.6923 3.2447 3.9355 4.7614 4.8900 3.0036 2.4550 2.6502 2.4838 3.4763 2.8754 2.5336 5.9681 3.8020 7.3878 4.7011 5.9860 5.9294 5.5361 6.4968 1.0702 1.0872 1.0875 1.0872 1.0859 1.0914 1.0933 1.0911 1.0969 1.0963 1.1002 1.0929 1.0987 1.0942 1.0742
irintensity: 0.0413 0.4994 0.2058 0.7825 0.8057 0.9750 0.0255 0.7151 1.8642 3.0501 3.2301 2.0111 1.5019 2.2723 0.0637 0.7012 17.3899 1.3802 2.3452 13.7539 9.5511 6.8192 4.4562 5.7828 0.7772 10.0841 0.3888 1.7085 0.7137 0.5128 7.2202 20.4324 9.0354 11.1110 12.5389 24.1373 3.7869 0.4950 11.2063 15.9686 11.3051 21.8802 43.4985 56.6947 5.4555 62.0985 20.2226 47.5338 43.2489 37.4973 1.3001 0.1923 11.3794 15.5201 55.0822 33.6583 94.7719 3.2531 3.2986 0.0479 0.0201 0.6773 9.3559 9.8974 2.8865 6.1833 3.1259 4.4832 53.7784 29.5379 6.2182 3.7531 55.7194 1.1970 2.6376 142.5301 3.1004 1.5780 40.2644 70.3136 5.5203 163.7039 87.3548 251.7426 34.1120 3.2572 129.2273 98.9893 96.7063 213.7499 28.6538 51.0958 70.1516 42.2482 12.1820 361.3331 593.7993 61.5790 4.5038 3.3093 1.5803 28.4052 1.3552 7.9253 117.9420 613.6903 33.4368 1.0500 1.5374 1.0373 11.2678 28.6853 8.7348 35.4341 24.2651 25.3348 1.6677 17.4170 8.0008 24.4806
temp: 298.150 k
press: 1.00000 atm
elementType: 8 8 8 7 6 6 6 6 6 6 6 6 6 6 6 6 6 6 6 6 6 6 6 6 6 6 6 1 1 1 1 1 1 1 1 1 1 1 1 1 1 1
symmnumber: 1
zpe: 831822.2 jmol-1
zpe.correction: 0.316824 hartree
zpe.thermalcorrener: 0.336972 hartree
zpe.thermalcorrenthalpy: 0.337916 hartree
zpe.thermalcorrgfe: 0.266014 hartree
zpe.sumelectzpe: -1164.103702 hartree
zpe.sumelectthermal: -1164.083554 hartree
zpe.sumelectthermalent: -1164.082610 hartree
zpe.sumelectthermalfe: -1164.154513 hartree
dipole: -0.0056 -3.8810 -0.0696
dipole: 3.8817
quadrupole: -116.0067 -152.7613 -164.6203
quadrupole: -0.6944 -0.9419 -0.9822
quadrupole: 28.4560 -8.2985 -20.1575 -0.6944 -0.9419 -0.9822
hfenergy: -1164.4205264 hartree
pointgroup: C01 [X(C23H15N1O3)]
dipole: -0.0104497 1.0282516 1.1290747 debye
polarizability: 530.2239705|-31.3874545|207.6794008|9.9083973|110.3983212|217.8232198 unknown
InChI: InChI=1S/C23H15NO3/c25-20-12-17-16-9-3-4-11-21(16)27-22(17)13-18(20)23(26)24-19-10-5-7-14-6-1-2-8-15(14)19/h1-13,24-25H
charge 0 multiplicity 1
42 atoms
O  -3.033262 1.221341 1.143276
O  -1.136441 -2.216246 -2.818044
O  1.230858 -1.885712 -2.050661
N  1.802956 -0.370394 -0.362847
C  -3.364594 -0.217683 -0.694923
C  -4.668558 0.276474 -0.25915
C  -2.404958 0.381422 0.181147
C  -4.419642 1.139449 0.849771
C  -0.566625 -0.718984 -0.935338
C  -1.037937 0.156038 0.090109
C  -2.917003 -1.0878 -1.701327
C  -1.52789 -1.346754 -1.824105
C  3.954626 0.378502 0.554475
C  3.220061 -0.500621 -0.340397
C  -6.001522 0.078284 -0.687438
C  0.872206 -1.028793 -1.146655
C  5.396308 0.2398 0.621936
C  -5.428118 1.81284 1.549758
C  -7.037288 0.74586 0.001895
C  3.903177 -1.43949 -1.131445
C  -6.754176 1.600174 1.103919
C  3.337409 1.381143 1.376539
C  6.05983 -0.734417 -0.193184
C  6.14332 1.08746 1.505693
C  5.321959 -1.547923 -1.051805
C  4.091424 2.194038 2.227294
C  5.510416 2.045633 2.297575
H  -0.376589 0.641884 0.814963
H  -3.594311 -1.585375 -2.400028
H  -6.22803 -0.577676 -1.534336
H  -5.198089 2.466422 2.39528
H  1.422814 0.307412 0.295927
H  -8.076324 0.606191 -0.313958
H  3.333168 -2.079999 -1.804693
H  -7.578535 2.104438 1.619468
H  2.253743 1.553455 1.354656
H  7.150076 -0.824841 -0.131175
H  7.232357 0.966905 1.544878
H  5.826397 -2.289961 -1.679565
H  3.59292 2.952141 2.840654
H  6.092571 2.686572 2.967873
H  -0.106201 -2.305809 -2.75041
