program: Gaussian 09
title: 000078096
version: EM64L-G09RevD.01
frameworkgroup: C1[X(C8H10N2O4)]
method: RPBEPBE
basis: SDD
operation: Freq
keyword: #p
keyword: freq=noraman
keyword: PBEPBE/SDD
title: #p freq=noraman PBEPBE/SDD
converged: YES YES NO NO
title: Mulliken charges:
elementType: O O O O N N C C C C C C C C H H H H H H H H H H
charge: -0.368941 -0.241351 -0.257650 -0.248437 -0.381876 -0.431371 -0.090463 0.145666 0.322003 0.244434 -0.227758 -0.225225 -0.477396 -0.478913 0.316713 0.298555 0.336802 0.207307 0.213657 0.393328 0.222395 0.252296 0.224172 0.252054
chargesum: 0.00000
title: Mulliken charges with hydrogens summed into heavy atoms:
elementType: O O O O N N C C C C C C C C
charge: 0.024387 -0.241351 -0.257650 -0.248437 -0.083320 -0.094569 0.226250 0.145666 0.322003 0.244434 -0.020451 -0.011568 -0.002705 -0.002687
polarizability: 1.53712578e+02 -9.25959809e+00 1.22947087e+02 1.06518062e+01 -9.02269199e+00 7.92645085e+01
1716.lowfreq: -0.0012 -0.0008 -0.0007 1.4790 5.7658 9.3737 31.1074 39.2849 61.8386
frequency: 31.0924 39.2616 61.8322 67.4834 76.8594 99.7578 120.0615 134.7970 179.5615 232.3779 258.5388 292.4197 299.9248 350.9082 353.6007 449.5067 486.6082 517.1200 536.8191 578.5789 591.6352 605.5066 628.1847 659.7332 673.2618 712.3646 783.1183 789.2890 850.4089 910.7704 963.6691 982.3100 985.9293 994.6579 997.7442 1044.6705 1059.2255 1060.3703 1075.5749 1119.6175 1178.6773 1212.7057 1261.4720 1302.5530 1307.1256 1334.9654 1350.4027 1407.1288 1407.2857 1447.1531 1481.1886 1597.1528 1606.3696 1639.2206 1648.6015 1651.0135 2986.1789 3096.8376 3097.2305 3113.4060 3113.5557 3218.4482 3220.0617 3496.5849 3513.9137 3547.0705
redmass: 6.9210 6.4043 4.4230 6.9149 6.1445 5.0370 2.6361 2.9655 3.9417 4.2880 5.4084 5.7978 4.2362 3.8977 5.2890 3.0534 1.6930 1.9355 1.4572 3.5626 4.2194 1.3617 1.1844 2.8992 3.3993 4.0876 3.6925 3.7544 5.0288 3.8962 3.1949 1.2345 1.2780 1.2005 1.1630 3.7074 1.6422 1.7705 2.8079 3.6821 2.1089 1.9924 1.3891 1.3129 1.4289 1.3928 2.2473 1.2220 1.2045 1.8037 1.9852 7.8083 8.0763 7.7811 4.6647 4.7789 1.0824 1.0634 1.0661 1.0902 1.0876 1.1163 1.1164 1.0777 1.0642 1.0780
irintensity: 0.2937 0.7206 3.1295 8.6057 6.0107 7.3944 0.7538 0.7784 3.7328 1.9543 2.0057 15.1036 10.0629 6.7793 11.0165 13.0734 23.2004 18.7151 27.1535 108.6667 42.7518 141.3805 92.7999 2.6906 12.1151 38.7167 25.5293 29.9240 19.3081 14.5624 1.2157 1.8020 0.1320 78.3759 86.8850 80.6916 10.2189 13.7637 122.6500 44.9523 211.9328 34.8202 1.3397 2.0821 9.5461 89.2457 147.3445 56.5787 41.2449 293.5513 223.2102 129.0785 157.9581 204.3758 27.2129 14.2017 35.7968 6.6388 7.8468 13.8781 14.6773 7.3534 7.2267 81.6664 37.4074 18.0532
temp: 298.150 k
press: 1.00000 atm
elementType: 8 8 8 8 7 7 6 6 6 6 6 6 6 6 1 1 1 1 1 1 1 1 1 1
symmnumber: 1
zpe: 465894.4 jmol-1
zpe.correction: 0.177450 hartree
zpe.thermalcorrener: 0.192308 hartree
zpe.thermalcorrenthalpy: 0.193252 hartree
zpe.thermalcorrgfe: 0.133579 hartree
zpe.sumelectzpe: -720.182600 hartree
zpe.sumelectthermal: -720.167742 hartree
zpe.sumelectthermalent: -720.166797 hartree
zpe.sumelectthermalfe: -720.226471 hartree
dipole: -0.5837 2.1109 -4.4545
dipole: 4.9638
quadrupole: -68.3939 -77.4204 -82.4962
quadrupole: 2.0408 -4.2802 6.6481
quadrupole: 7.7096 -1.3169 -6.3927 2.0408 -4.2802 6.6481
hfenergy: -720.3600496 hartree
pointgroup: C01 [X(C8H10N2O4)]
dipole: -0.145784 0.1923095 -1.937949 debye
dipolederiv: -0.8647795 -0.4869326 -0.1005535 -0.4143547 -0.6852257 -0.151092 -0.1019598 -0.1665993 -0.3511758 -0.811466 -0.0945206 -0.2016761 0.1484082 -0.7586443 0.2718432 -0.4475549 0.1921989 -0.595696 -0.6442635 0.1522873 -0.0537028 0.1119603 -0.4875961 -0.1891208 -0.1914892 -0.1334022 -0.8111222 -0.6463201 0.0025129 -0.1812098 -0.1655797 -0.5722543 0.1865422 -0.0152104 0.2225411 -0.6274969 -1.2325024 0.0403167 -0.2692389 0.3133775 -0.626882 0.3007921 -0.2647529 0.1661325 -0.4999936 -0.9698871 -0.2552657 0.2085451 -0.5227444 -0.9640128 0.2041254 0.3441185 0.2582036 -0.5169017 1.1574295 0.1202789 -0.1146708 -0.0906808 0.3810764 0.0600731 -0.2829162 0.2831123 0.0968365 1.1356959 0.4683278 0.4108968 0.1774992 1.2621496 -0.3404518 0.6572915 -0.2461241 0.6349653 1.2864625 -0.4823867 0.4136372 -0.5558338 0.6426844 -0.0006979 0.5275461 0.0708867 1.0220756 1.1976663 0.4701436 0.0398035 0.6934949 0.9827088 -0.4438215 -0.1260968 -0.4618395 0.7390934 -0.3602902 0.1293949 0.043846 0.1339048 -0.228322 0.0805779 -0.0371255 0.102102 0.0611979 -0.3309872 -0.1427368 0.0760102 -0.2161142 -0.1874717 -0.1299225 0.0976384 -0.1015736 -0.0340348 -0.0938438 -0.1486339 0.0064148 -0.1033796 -0.1374819 0.1153503 0.1175635 0.0492027 0.0242915 -0.0356538 0.038031 0.1293303 0.1059839 -0.1075189 -0.1139268 0.0485941 -0.1600896 -0.0857007 0.1430025 -0.0821985 0.0083709 0.0076698 0.0965355 0.0191372 0.0957924 -0.1204512 0.0882814 0.2274226 0.1074897 -0.0595436 0.1212324 0.2293362 -0.0545485 -0.0232162 -0.0756816 0.1399372 0.1710669 -0.027215 -0.0348251 0.0663968 0.3549606 0.045779 -0.1028152 -0.0158873 0.262323 0.0704144 0.0466853 -0.0711825 0.0694913 0.0932408 -0.0608777 -0.0098542 -0.1008486 -0.0964895 0.0317587 -0.0254131 -0.0627454 0.0168566 0.0502085 0.1330761 -0.1073069 0.1081115 0.0000552 0.3303437 0.0785356 -0.0681342 0.0210538 0.2345492 0.1043562 -0.0570143 0.1493309 0.2851479 0.0232501 0.1106639 0.0263658 0.1234846 0.0513256 -0.0529067 0.0366694 -0.0621185 0.0824748 0.1586706 0.0250922 -0.0033585 0.0103751 0.1427061 -0.0718064 -0.0291569 -0.0526243 0.0061057 -0.0590577 -0.0722278 -0.0665447 -0.0627045 0.1150019 0.0170137 -0.0728565 0.0118639 0.111019 0.1158674 0.0277711 -0.0758349 0.0102023 0.1189263 0.0705063 -0.055888 0.0835539 0.0648069 unknown
polarizability: 152.5129996|0.2545517|112.1779677|18.6913437|-18.9888618|91.2332065 unknown
InChI: InChI=1S/C8H10N2O4/c1-3-5(11)9-7(8(13)14)10-6(12)4-2/h3-4,7,9-10,13H,1-2H2
charge 0 multiplicity 1
24 atoms
O  1.194633 2.885768 -0.506191
O  -0.787724 2.701822 -1.702949
O  2.107867 0.056148 1.403443
O  -1.332005 -1.350089 1.027175
N  1.073481 -0.027845 -0.681937
N  -1.345287 0.279316 -0.636311
C  -0.045817 0.823999 -0.262282
C  0.052088 2.221538 -0.904682
C  2.067272 -0.409374 0.22684
C  -1.92921 -0.7752 0.068266
C  3.05934 -1.384881 -0.323206
C  -3.294703 -1.154082 -0.417061
C  4.08703 -1.83974 0.436867
C  -3.988599 -2.162585 0.168538
H  0.064709 0.909156 0.83923
H  1.03424 -0.445527 -1.61383
H  -1.867865 0.798249 -1.349931
H  2.929749 -1.726582 -1.359595
H  -3.720428 -0.589723 -1.258369
H  1.241949 3.780508 -0.940977
H  4.818635 -2.557518 0.051785
H  4.195047 -1.488038 1.469529
H  -4.989585 -2.449799 -0.169411
H  -3.544017 -2.710319 1.007958
