program: Gaussian 09
title: 000078077
version: EM64L-G09RevD.01
frameworkgroup: C1[X(C2H2N2O)]
method: RPBEPBE
basis: SDD
operation: Freq
keyword: #pfreq=noraman
keyword: PBEPBE/SDD
title: #p freq=noraman PBEPBE/SDD
converged: NO NO NO NO
title: Mulliken charges:
elementType: O N N C C H H
charge: -0.198892 -0.586592 0.024939 0.236007 -0.178850 0.347402 0.355987
chargesum: 0.00000
title: Mulliken charges with hydrogens summed into heavy atoms:
elementType: O N N C C
charge: -0.198892 0.116796 0.024939 0.236007 -0.178850
polarizability: 4.97316812e+01 -7.69351559e-01 3.68943902e+01 -8.66342001e-04 -1.70473013e-03 1.62312984e+01
1716.lowfreq: -0.0013 -0.0008 -0.0008 12.5691 14.6653 16.0368 195.4392 276.4489 461.0399
frequency: 195.4383 276.4472 461.0398 532.6735 593.4999 614.0453 728.0776 751.6076 1062.8404 1307.2701 1593.5232 1644.3275 2174.7443 3511.7110 3665.6596
redmass: 7.4196 6.0965 3.8478 1.1117 8.7311 1.2801 7.9137 4.6666 1.9213 4.1675 1.5545 3.1465 12.6819 1.0456 1.1050
irintensity: 11.3177 1.2541 4.5046 74.8101 0.9334 237.4080 50.1994 17.0385 0.3670 158.1878 46.1055 358.8969 14.7160 70.7399 46.3865
temp: 298.150 k
press: 1.00000 atm
elementType: 8 7 7 6 6 1 1
symmnumber: 1
zpe: 114320.6 jmol-1
zpe.correction: 0.043542 hartree
zpe.thermalcorrener: 0.048406 hartree
zpe.thermalcorrenthalpy: 0.049351 hartree
zpe.thermalcorrgfe: 0.015828 hartree
zpe.sumelectzpe: -261.757158 hartree
zpe.sumelectthermal: -261.752294 hartree
zpe.sumelectthermalent: -261.751349 hartree
zpe.sumelectthermalfe: -261.784872 hartree
dipole: -2.7738 -4.0241 0.0004
dipole: 4.8874
quadrupole: -32.0324 -27.1207 -28.5697
quadrupole: 5.3664 -0.0009 -0.0007
quadrupole: -2.7915 2.1202 0.6712 5.3664 -0.0009 -0.0007
hfenergy: -261.8007 hartree
pointgroup: C01 [X(C2H2N2O1)]
dipole: 1.0025923 -1.6408022 -0.0001459 debye
dipolederiv: -0.6221248 -0.2367349 -0.0000133 0.0085018 -0.9144418 -0.0000697 0.0000273 -0.0000048 -0.3484735 -0.4844969 0.4358608 -0.0000103 0.3217693 -0.9452728 -0.0000419 0.0000074 -0.0000856 -0.718458 -0.100515 -0.0483968 0.0000844 0.0394222 -0.1673547 -0.0000041 0.0000063 -0.0000083 -0.2070674 1.257562 -0.1309383 -0.0000862 -0.2256469 1.7287655 0.0001536 -0.0001048 0.0001312 0.4158427 -0.4381371 0.0386533 -0.0000311 -0.0813246 -0.1124667 0.0000073 0.0000141 0.0000079 0.0436184 0.165919 -0.0094196 0.0000364 -0.0483353 0.2212587 -0.0000222 0.0000289 -0.000028 0.4144543 0.221793 -0.0490246 0.0000201 -0.0143866 0.1895117 -0.000023 0.0000209 -0.0000124 0.4000835 unknown
polarizability: 49.7773479|0.0598305|36.8487235|-0.0007713|0.0017498|16.2312984 unknown
InChI: InChI=1S/C2H2N2O/c3-1-2(4)5/h4H2
charge 0 multiplicity 1
7 atoms
O  1.182626 1.165337 -0.000039
N  1.209303 -1.175992 -0.000248
N  -2.088426 -0.018978 -0.000035
C  0.58672 0.054529 -0.000017
C  -0.893997 -0.03743 0.000113
H  0.680796 -2.048466 -0.000281
H  2.229478 -1.207099 -0.000394
