program: Gaussian 09
title: 000078063
version: EM64L-G09RevD.01
frameworkgroup: C1[X(C8H9N3O2S)]
method: RPBEPBE
basis: SDD
operation: Freq
keyword: #p
keyword: freq=noraman
keyword: PBEPBE/SDD
title: #p freq=noraman PBEPBE/SDD
converged: YES YES NO YES
title: Mulliken charges:
elementType: S O O N N N C C C C C C C C H H H H H H H H H
charge: 0.152855 -0.209692 -0.209691 0.026429 -0.602425 -0.310773 0.480863 -0.795717 -0.342593 -0.342607 0.370783 -0.349544 -0.349545 -0.080097 0.300810 0.300827 0.252077 0.252073 0.286193 0.286192 0.322739 0.330990 0.229855
chargesum: 0.00000
title: Mulliken charges with hydrogens summed into heavy atoms:
elementType: S O O N N N C C C C C C C C
charge: 0.152855 -0.209692 -0.209691 0.026429 0.051303 -0.080918 0.480863 -0.194081 -0.090516 -0.090534 0.370783 -0.063351 -0.063354 -0.080097
polarizability: 2.34264477e+02 -5.59828845e-04 1.10386657e+02 1.07205647e+01 -9.15335700e-04 8.98191201e+01
1716.lowfreq: -26.1030 -12.4828 -7.0540 -0.0021 -0.0015 0.0008 2.1192 19.6797 43.7991
frequency: -25.6164 17.9147 43.7964 44.1634 67.8597 127.7829 158.5114 204.2122 282.2367 323.8134 331.7540 368.4305 378.8687 406.2451 407.6237 455.3874 489.9371 505.7241 560.5657 590.7039 620.6251 626.8532 652.2433 677.6990 736.1874 750.7001 765.2857 822.2544 849.5461 872.5439 891.0526 986.2784 987.6978 993.4093 1006.1801 1042.6327 1091.6873 1091.7096 1127.7607 1180.5977 1217.8061 1221.3091 1244.4572 1284.1373 1299.9066 1363.8776 1403.3325 1417.7179 1444.4187 1480.3509 1596.4676 1607.5414 1615.3794 1642.0114 3057.9935 3132.5786 3146.3288 3148.7280 3184.3706 3186.7734 3364.9932 3527.9371 3675.3747
redmass: 5.2081 4.6997 7.6352 6.9132 7.2026 6.9443 8.9785 4.8990 6.1046 1.2822 1.8871 4.7071 6.6052 1.3062 2.6110 6.8160 3.8737 7.0845 3.3774 2.9010 6.4148 6.8234 6.8320 3.9473 1.3707 5.1414 6.1356 5.3795 1.2457 1.7713 1.5263 1.3537 1.7148 1.3749 3.0540 1.5479 3.3253 1.2188 1.1023 1.3299 2.0270 4.9177 1.6861 2.6951 1.2786 7.9446 8.9690 3.5117 1.1132 2.5036 7.7892 5.2636 1.4932 2.9623 1.0582 1.1082 1.0908 1.0909 1.0945 1.0957 1.0770 1.0449 1.1044
irintensity: 1.1951 4.8901 0.5592 13.1702 0.1295 5.7960 4.1268 0.8042 0.7190 0.2691 2.2356 3.2084 6.6357 288.7315 24.8114 5.1551 4.5379 0.7683 15.8606 96.3095 0.7855 0.5778 2.2712 44.4018 87.2703 15.6079 28.2834 1.1864 0.0135 51.9152 0.5612 15.9273 195.8696 0.0012 3.9854 9.2271 17.4999 14.3972 5.1198 65.3145 26.1787 333.0526 24.5831 185.0117 0.0001 97.8142 0.0820 50.1181 7.1170 5.2051 1.4617 105.7780 87.8408 261.2455 5.9538 1.0427 8.9064 5.1353 0.0030 4.0229 22.9249 38.8775 22.0177
temp: 298.150 k
press: 1.00000 atm
elementType: 16 8 8 7 7 7 6 6 6 6 6 6 6 6 1 1 1 1 1 1 1 1 1
symmnumber: 1
zpe: 435454.3 jmol-1
zpe.correction: 0.165856 hartree
zpe.thermalcorrener: 0.178977 hartree
zpe.thermalcorrenthalpy: 0.179922 hartree
zpe.thermalcorrgfe: 0.123674 hartree
zpe.sumelectzpe: -1021.899259 hartree
zpe.sumelectthermal: -1021.886137 hartree
zpe.sumelectthermalent: -1021.885193 hartree
zpe.sumelectthermalfe: -1021.941441 hartree
dipole: 8.0257 -0.0001 -0.3199
dipole: 8.0320
quadrupole: -89.1587 -86.6558 -88.3833
quadrupole: -0.0025 -11.0244 0.0006
quadrupole: -1.0927 1.4102 -0.3174 -0.0025 -11.0244 0.0006
hfenergy: -1022.0651145 hartree
pointgroup: C01 [X(C8H9N3O2S1)]
dipole: -3.1549707 -0.000313 -0.1789924 debye
dipolederiv: -0.8667809 -0.0000369 0.0315233 -0.0000265 -0.1199133 -0.0000282 0.1650748 -0.0000407 -0.1632816 -0.787959 -0.2016514 0.0731783 -0.2624263 -0.6706561 0.0307371 0.0999786 0.036111 -0.2433253 -0.7880393 0.2017481 0.0728783 0.2625598 -0.6706797 -0.0300805 0.0995822 -0.035446 -0.2432242 1.9772545 -0.0001127 -0.2378883 -0.0001701 1.0933957 -0.0006656 -0.321129 -0.0006771 0.2332897 -1.0710347 -0.0006486 -0.5459779 -0.0005488 -0.6873545 -0.0001429 -0.3987736 -0.0001249 -0.7741013 -0.4197247 0.0000761 0.0694283 0.0005206 -0.441186 -0.0007371 0.5936887 -0.0005922 -1.2225866 0.5709491 0.000048 0.0187162 -0.000007 0.0910072 -0.000109 -0.0721035 -0.0001227 -0.0685884 0.2836323 0.0000846 0.1072217 0.0002058 0.1037121 0.0000632 0.2229089 0.0000724 0.1943477 -0.3251453 -0.1693337 -0.0055427 -0.249008 0.0440847 0.0318171 0.0443623 0.0254434 -0.1240442 -0.3252347 0.1692645 -0.0058105 0.2490088 0.0440667 -0.0320847 0.0439726 -0.0256995 -0.1239508 -0.822069 0.0000017 0.0927192 0.0000361 0.0435243 -0.0000076 0.1571643 -0.0000015 0.029893 0.2011916 0.1198622 -0.0401892 -0.1911087 -0.0386977 0.0279182 -0.0579118 -0.0249444 -0.085738 0.2011895 -0.1198891 -0.039996 0.1910694 -0.03869 -0.0279979 -0.0582086 0.024862 -0.0857327 1.7226611 0.0003587 0.176196 -0.000222 0.0786778 0.0012066 -0.4509995 0.0011525 1.4401221 0.0236986 0.0010666 -0.0174503 -0.0105791 -0.0026339 0.0554262 -0.0709558 0.046229 0.0010709 0.0237312 -0.0010895 -0.017434 0.0104597 -0.002755 -0.0554125 -0.0709772 -0.0462223 0.0012269 0.0421601 0.0818429 0.0274739 0.0891092 -0.0155331 -0.0101998 0.0235691 -0.0139373 0.1330461 0.0421847 -0.0817947 0.0276022 -0.0890596 -0.0155269 0.0104381 0.0237074 0.0141763 0.1330094 0.0965406 -0.0608447 0.0101575 -0.0261304 0.0593515 0.0049279 0.0171863 0.0113407 0.1672447 0.0965233 0.0608674 0.0100634 0.0261652 0.0593395 -0.0047557 0.0171457 -0.0111692 0.1672702 0.119008 0.0000657 0.0377192 0.0001048 0.391202 -0.0001789 0.0169882 -0.0002208 0.1567139 0.2388885 0.000064 0.0531365 0.0001334 0.4091542 -0.0001502 0.0737524 -0.000196 0.165393 -0.2336254 0.0000509 0.1022749 -0.0000862 0.2861106 0.0000163 -0.0980223 0.0000073 0.3119454 unknown
polarizability: 234.584489|0.0021663|110.3866464|-8.2827437|-0.0152933|89.4991188 unknown
InChI: InChI=1S/C8H9N3O2S/c9-8(10)14-5-6-1-3-7(4-2-6)11(12)13/h1-4,9H,5,10H2
charge 0 multiplicity 1
23 atoms
S  -2.754942 -0.00099 -0.889673
O  4.491644 1.140337 -0.373386
O  4.491843 -1.140526 -0.371657
N  3.893698 -0.000066 -0.2657
N  -5.421172 -0.001632 -1.251386
N  -4.669894 0.000498 1.070558
C  -0.334164 0.000162 0.49797
C  -1.816798 0.000241 0.773012
C  0.375109 1.224073 0.365189
C  0.375322 -1.223831 0.367119
C  2.433285 0.000007 -0.005206
C  1.760117 1.23558 0.114955
C  1.760333 -1.23549 0.116897
C  -4.486286 -0.000731 -0.220054
H  -2.159419 -0.891667 1.317621
H  -2.159561 0.892856 1.316373
H  -0.167252 2.171017 0.459219
H  -0.166872 -2.17072 0.462645
H  2.323864 2.166245 0.012809
H  2.324241 -2.166218 0.01621
H  -6.416514 -0.001239 -1.037051
H  -5.136606 -0.002432 -2.22939
H  -5.659678 0.000726 1.380926
