program: Gaussian 09
title: 000078060
version: EM64L-G09RevD.01
frameworkgroup: C1[X(C8H12O3)]
method: RPBEPBE
basis: SDD
operation: Freq
keyword: #pfreq=noraman
keyword: PBEPBE/SDD
title: #p freq=noraman PBEPBE/SDD
converged: YES YES NO NO
title: Mulliken charges:
elementType: O O O C C C C C C C C H H H H H H H H H H H H
charge: -0.134755 -0.373050 -0.212360 -0.107576 -0.434177 -0.440099 -0.401585 -0.394935 -0.385567 0.063930 0.099420 0.257334 0.219481 0.212479 0.228182 0.212429 0.204955 0.195537 0.199954 0.207348 0.203597 0.193802 0.385655
chargesum: 0.00000
title: Mulliken charges with hydrogens summed into heavy atoms:
elementType: O O O C C C C C C C C
charge: -0.134755 0.012605 -0.212360 0.149758 -0.002217 0.000512 -0.001093 0.012368 0.011832 0.063930 0.099420
polarizability: 1.10011749e+02 2.02203494e+00 9.00863848e+01 -3.25365520e+00 -4.94029938e+00 7.31831448e+01
1716.lowfreq: -19.4215 0.0006 0.0010 0.0011 6.4953 11.9299 24.1148 48.1180 93.0387
frequency: 23.8571 47.9393 92.9780 135.0484 212.4690 228.1999 273.9025 305.8337 352.5507 402.6513 423.5257 438.9809 486.3771 531.4277 618.0446 639.1592 732.9257 784.2528 789.5688 807.0261 855.8213 880.8088 892.9388 919.3460 966.0488 1024.0025 1047.0063 1053.4047 1074.9349 1098.9618 1113.0161 1141.4608 1181.9477 1235.8865 1252.4166 1261.8767 1282.0754 1296.0399 1313.9111 1320.0087 1336.8474 1341.9953 1348.3843 1361.1760 1459.9740 1461.8985 1462.6820 1470.4971 1476.7841 1619.1918 1627.8454 2968.5235 2970.3014 2972.2426 2976.3591 2985.5040 2991.1229 3030.8847 3031.8426 3040.2696 3048.0472 3055.0890 3500.4406
redmass: 8.6049 4.8394 3.5269 4.6398 2.6764 2.2108 4.9531 3.4414 2.4173 3.8765 3.0112 3.2572 2.0333 3.3112 3.8220 1.3423 4.9439 1.9729 1.7970 4.4982 2.3923 1.8173 1.5233 2.0148 3.0959 2.6752 1.9617 1.2187 1.4739 2.0686 2.3390 2.1027 1.4920 1.3655 1.3350 1.2440 1.2423 1.4789 1.5047 1.5943 1.3678 1.4736 1.5501 1.6275 1.0846 1.0872 1.0890 1.0813 1.0948 9.9828 11.2508 1.0641 1.0607 1.0631 1.0665 1.0723 1.0658 1.0982 1.0949 1.1020 1.1030 1.1029 1.0642
irintensity: 3.5040 0.0353 0.5171 1.5594 3.5903 1.2455 5.5682 1.5133 0.2197 5.3245 2.7749 4.5606 2.2119 3.1017 87.6329 155.2666 6.3608 0.2369 0.4875 11.8369 3.0762 5.2403 14.0501 10.4908 146.0150 110.1224 4.8424 0.2795 8.0674 41.1954 2.7042 9.1828 2.5618 10.6387 0.0329 1.7424 27.6992 17.9291 1.2258 0.8004 0.3925 0.5187 0.6199 4.6161 0.6695 12.4936 10.7529 20.9071 1.3270 122.6038 159.6656 34.0085 34.9270 30.8718 10.9829 11.5206 14.6462 67.2384 57.1294 27.5104 10.0789 91.3181 34.3753
temp: 298.150 k
press: 1.00000 atm
elementType: 8 8 8 6 6 6 6 6 6 6 6 1 1 1 1 1 1 1 1 1 1 1 1
symmnumber: 1
zpe: 496908.0 jmol-1
zpe.correction: 0.189262 hartree
zpe.thermalcorrener: 0.200097 hartree
zpe.thermalcorrenthalpy: 0.201042 hartree
zpe.thermalcorrgfe: 0.151441 hartree
zpe.sumelectzpe: -536.860237 hartree
zpe.sumelectthermal: -536.849402 hartree
zpe.sumelectthermalent: -536.848458 hartree
zpe.sumelectthermalfe: -536.898059 hartree
dipole: -0.9108 -1.6663 0.2932
dipole: 1.9215
quadrupole: -56.7282 -72.0143 -66.9316
quadrupole: -5.1119 1.1150 5.4131
quadrupole: 8.4965 -6.7896 -1.7069 -5.1119 1.1150 5.4131
hfenergy: -537.0494995 hartree
pointgroup: C01 [X(C8H12O3)]
dipole: -0.3747759 -0.6506475 0.0875966 debye
dipolederiv: -0.5955165 -0.0494401 0.0146177 -0.1707686 -0.6614664 0.1053605 0.1492218 0.1731585 -0.2933122 -1.1907759 -0.2295338 0.3385534 -0.1054531 -0.2780783 -0.0300951 0.3241751 0.0000801 -0.4775669 -0.7035259 0.1242736 -0.0033637 -0.1588458 -0.6537143 0.2947787 0.1883178 0.1961269 -0.48586 -0.4557597 -0.1774884 0.0363848 -0.2949544 -0.1696754 -0.0021473 -0.0659472 -0.0534396 0.0695814 0.0472219 -0.0058461 0.0012593 -0.0568049 0.0809506 0.0052528 0.0454632 -0.028583 0.1085005 -0.0159653 -0.0179778 0.0433301 0.1386767 0.1549261 -0.0211672 0.2258128 0.0718948 0.1514918 0.0526339 -0.02485 0.0054354 0.0320561 0.0774856 -0.0644839 -0.0214441 -0.0374266 0.1334301 0.0978507 0.0247216 0.0154846 -0.034174 0.062315 -0.0232784 -0.0997223 -0.0908992 0.1221323 0.0697756 0.0135848 -0.0116273 -0.0103826 0.0629812 -0.048913 0.0329004 -0.0422086 0.1205198 1.124663 0.1177228 -0.0304087 0.1827388 0.6887399 -0.1590425 -0.2368566 -0.2228497 0.1782284 1.2916157 0.112571 -0.3286076 0.2493641 0.6364134 -0.3586135 -0.4582308 -0.2855786 0.5698797 0.0913147 0.0089348 -0.0013746 0.0563577 0.0415131 0.0655791 -0.010029 0.0590378 -0.0427249 0.049884 0.0060842 0.0101749 0.0230031 0.0331708 0.0608042 0.0005224 0.1138754 -0.0825163 0.0024519 -0.0655304 -0.0626465 -0.0339853 -0.0424915 -0.1096752 -0.0541009 -0.1221268 -0.0408568 -0.0473633 0.1191846 0.0347706 0.116798 -0.0638179 -0.0516101 0.0247532 -0.0170711 0.0580715 0.0416558 -0.0350164 -0.0226132 -0.0389758 0.0031683 0.1134752 -0.016169 0.0497144 -0.1048148 -0.0880979 0.1218733 0.0373487 0.1389716 -0.1040809 -0.0560352 0.0173576 -0.0283345 0.0670802 0.0485896 -0.0131769 -0.0408389 -0.0476488 0.0109301 0.1242799 0.0029914 0.0677242 -0.1492209 0.0240463 0.0316724 -0.0109666 0.0158147 0.003633 0.0847108 0.0168553 0.1499362 -0.1069382 -0.0277293 -0.0743613 -0.0492939 -0.0697732 -0.0692937 -0.1199921 -0.0393588 -0.1427001 -0.0465841 -0.2085764 -0.0763283 0.0403277 -0.091542 0.0226516 -0.0017111 0.0718003 0.0064798 0.0591915 0.0836315 0.0094135 0.0070998 0.0486434 -0.0226683 0.0917773 -0.0561378 0.0774656 -0.145533 0.3079756 0.079513 -0.023046 0.1108842 0.186408 0.1007462 -0.0421748 0.1057241 0.3378207 unknown
polarizability: 110.0085735|1.5948908|90.4401988|-3.8195671|-3.9951156|72.832506 unknown
InChI: InChI=1S/C8H12O3/c9-7(8(10)11)6-4-2-1-3-5-6/h6,10H,1-5H2
charge 0 multiplicity 1
23 atoms
O  1.401161 1.726425 -0.575867
O  3.460299 -0.066038 -0.401148
O  2.118257 -1.455813 0.891739
C  -0.259404 0.140134 0.309866
C  -1.246926 1.318193 0.469935
C  -0.769472 -0.875447 -0.772056
C  -2.666747 0.811552 0.812327
C  -2.19086 -1.372894 -0.417711
C  -3.179783 -0.196973 -0.242389
C  1.133097 0.610331 -0.072563
C  2.263051 -0.421539 0.199202
H  -0.17616 -0.429159 1.258622
H  -1.268798 1.900689 -0.471377
H  -0.883154 2.00784 1.255306
H  -0.07552 -1.733435 -0.845592
H  -0.787579 -0.36947 -1.758417
H  -3.360012 1.671288 0.886426
H  -2.655505 0.324191 1.809394
H  -2.146112 -1.961069 0.521691
H  -2.545829 -2.059562 -1.210472
H  -4.177297 -0.579696 0.047044
H  -3.304171 0.323462 -1.214499
H  4.158062 -0.744008 -0.183961
