program: Gaussian 09
title: 000078217
version: EM64L-G09RevD.01
frameworkgroup: C1[X(C21H22Cl3N3)]
method: RPBEPBE
basis: SDD
operation: Freq
keyword: #p
keyword: freq=noraman
keyword: PBEPBE/SDD
title: #p freq=noraman PBEPBE/SDD
converged: YES YES NO NO
title: Mulliken charges:
elementType: Cl Cl Cl N N N C C C C C C C C C C C C C C C C C C C C C H H H H H H H H H H H H H H H H H H H H H H
charge: -0.053905 -0.052949 -0.061656 -0.170399 -0.403232 -0.047984 -0.592324 0.443030 0.480217 -0.357041 -0.392157 -0.389244 -0.373885 -0.364680 -0.470344 -0.421485 0.365874 0.264503 -0.584297 -0.584893 -0.026618 -0.325088 -0.335706 -0.295495 -0.385550 -0.274097 -0.090707 0.224852 0.216937 0.227038 0.222290 0.250173 0.250985 0.248520 0.250333 0.236351 0.234870 0.248162 0.234006 0.325917 0.269424 0.291301 0.271092 0.290321 0.229903 0.204309 0.286183 0.233041 0.254105
chargesum: 0.00000
title: Mulliken charges with hydrogens summed into heavy atoms:
elementType: Cl Cl Cl N N N C C C C C C C C C C C C C C C C C C C C C
charge: -0.053905 -0.052949 -0.061656 -0.170399 -0.077315 -0.047984 -0.150534 0.443030 0.480217 0.092286 0.109001 0.109609 -0.137534 -0.129810 -0.222182 -0.187479 0.365874 0.264503 -0.023571 -0.023481 -0.026618 -0.095185 -0.131397 -0.009312 -0.152509 -0.019992 -0.090707
chargesum: -0.00014
polarizability: 3.29516700e+02 6.60275301e+00 3.58097369e+02 -2.89118617e-01 -1.06424670e+01 1.91741727e+02
1716.lowfreq: -3.7488 -1.8992 -0.1353 -0.0013 1.3823 2.6555 9.5723 10.4335 16.7227
frequency: 9.4468 9.8073 16.6891 32.0912 36.5716 40.2371 56.7699 65.3535 78.4574 95.1160 106.6471 130.3440 131.7719 142.1721 185.4523 203.0564 208.2959 221.4158 237.9463 243.1291 245.2432 265.0630 281.4037 300.2241 345.4899 363.7098 376.0125 386.9443 416.2822 421.3034 443.6002 478.9036 483.2762 506.2511 513.1925 520.5448 530.3260 558.1266 578.5681 617.1606 636.7308 641.5984 643.3819 658.8746 696.5123 699.2559 727.8653 740.8978 762.2488 782.9327 788.0947 792.2890 809.3816 810.6489 817.2026 825.3690 827.4422 854.0318 894.2791 896.2496 934.4723 943.0298 949.3447 951.3298 959.1063 977.1935 999.3806 1001.6534 1017.6647 1034.3195 1035.7359 1039.0083 1042.6740 1062.1189 1094.3162 1120.1099 1128.8346 1139.2023 1168.0250 1179.0800 1201.2063 1202.4254 1207.9144 1221.8826 1225.8092 1237.0805 1248.1580 1256.4179 1256.8939 1277.4485 1293.9557 1307.8052 1321.8771 1331.4566 1333.4171 1345.4091 1352.8820 1355.3138 1375.1567 1378.0401 1387.8944 1392.4440 1418.7186 1428.6907 1440.6221 1458.6759 1459.6752 1464.3518 1469.8846 1483.8267 1487.1856 1502.2526 1517.4065 1532.0943 1557.5653 1568.0093 1585.3274 1610.2680 1629.1237 2931.9028 2993.9185 3012.8369 3013.8808 3018.4944 3055.1976 3063.1829 3063.5114 3069.0385 3075.0914 3111.2675 3116.9588 3119.3971 3122.4132 3146.9614 3147.7109 3156.8188 3162.3013 3172.3665 3173.4110 3182.5926 3536.8628
redmass: 12.3341 11.5565 6.5114 12.0075 10.9634 7.0689 5.9382 3.6888 5.5491 4.2777 3.4963 2.9834 3.6307 4.0587 3.0328 9.1911 4.9657 6.2983 4.1850 3.2366 5.1536 5.5734 5.3158 4.6376 3.4932 2.8602 3.7596 5.0816 3.0590 2.8278 3.8990 2.5640 2.2062 2.9725 2.9371 3.0806 4.5902 2.9872 6.2567 5.8590 6.6475 3.9469 4.7980 5.9314 4.3239 4.1785 3.1972 4.3197 1.8684 1.1268 2.8622 1.3656 1.9658 2.0387 1.2602 1.6129 3.0674 4.1337 2.9223 1.5086 1.3494 1.3794 1.4306 2.4495 1.4653 2.5756 1.4555 2.5309 2.3841 4.0501 2.3867 2.4962 1.9239 1.8860 2.6607 1.5579 1.9775 1.5107 1.4707 1.6660 1.2794 1.2328 2.1188 2.1478 1.8320 1.4139 1.3828 1.1633 1.1631 1.3490 1.1876 1.7839 1.6663 1.8346 1.4709 1.7537 1.2760 1.4237 3.4472 2.5322 1.8033 4.3554 2.5719 3.2219 2.4376 1.0960 1.0957 1.1230 2.3150 1.0847 1.0821 1.1307 2.5698 4.9058 3.9466 6.4089 6.4183 6.6171 6.3147 1.0665 1.0648 1.0605 1.0900 1.0611 1.1027 1.0570 1.0582 1.1028 1.1035 1.0894 1.0898 1.0892 1.0883 1.1117 1.1117 1.0930 1.0936 1.0933 1.0951 1.0933 1.0760
irintensity: 0.2194 0.1094 0.8096 1.4728 0.2048 0.3227 0.3604 0.6998 0.5901 0.9820 1.4120 1.5229 0.4036 2.1144 1.0622 1.2026 1.7700 0.2657 5.8908 8.3136 0.4494 5.6667 0.6335 0.5185 9.5175 3.6884 8.2099 0.6790 0.2227 3.4265 6.1522 42.9837 20.6008 22.8607 2.3481 19.8675 21.8161 23.0243 6.6242 0.9695 0.8856 8.3516 10.8370 28.2516 69.7025 55.8170 6.3653 2.3820 14.5481 3.0604 7.2205 5.0107 55.5263 19.0646 1.5487 31.3217 71.1264 42.3164 12.8676 24.7447 0.0142 2.7035 0.9266 16.9945 6.3281 4.4609 3.4374 0.3784 1.5434 1.5867 0.0280 4.5229 0.6170 11.3771 9.0368 37.2103 17.5812 19.6278 2.3976 80.0310 8.1557 1.6400 16.6450 37.1274 3.6224 25.9692 2.1634 18.4153 16.0730 42.7530 7.2446 4.3441 9.8939 14.0659 21.7472 44.8888 6.4557 59.7468 3.1051 7.1207 54.6414 61.7115 14.6693 5.1710 50.5118 6.6770 15.3566 28.9606 79.5030 24.6558 59.3402 1.2924 312.0891 84.1112 174.9890 5.3411 382.1753 72.3719 139.5248 56.2560 16.6286 24.2300 68.1473 10.2936 20.2423 4.1803 25.7860 10.0747 10.3379 17.3274 34.5918 18.7601 15.5182 3.7821 19.5787 21.7530 11.5268 20.8173 5.4095 0.7564 129.3703
temp: 298.150 k
press: 1.00000 atm
elementType: 17 17 17 7 7 7 6 6 6 6 6 6 6 6 6 6 6 6 6 6 6 6 6 6 6 6 6 1 1 1 1 1 1 1 1 1 1 1 1 1 1 1 1 1 1 1 1 1 1
symmnumber: 1
zpe: 1014044.3 jmol-1
zpe.correction: 0.386229 hartree
zpe.thermalcorrener: 0.412224 hartree
zpe.thermalcorrenthalpy: 0.413168 hartree
zpe.thermalcorrgfe: 0.324068 hartree
zpe.sumelectzpe: -2355.923038 hartree
zpe.sumelectthermal: -2355.897044 hartree
zpe.sumelectthermalent: -2355.896100 hartree
zpe.sumelectthermalfe: -2355.985200 hartree
dipole: 5.6978 -3.6677 -2.4936
dipole: 7.2205
quadrupole: -225.8898 -180.8360 -185.2440
quadrupole: 10.2127 2.4631 4.6805
quadrupole: -28.5666 16.4873 12.0793 10.2127 2.4631 4.6805
hfenergy: -2356.3092674 hartree
pointgroup: C01 [X(C21H22Cl3N3)]
dipole: -2.2692167 -1.4728891 0.8667164 debye
polarizability: 329.3708124|-6.5749579|356.5032355|1.4318585|19.8534487|193.4817482 unknown
InChI: InChI=1S/C21H22Cl3N3/c22-9-13-27(14-10-23)18-4-1-16(2-5-18)7-11-25-20-8-12-26-21-15-17(24)3-6-19(20)21/h1-6,8,12,15,25H,7,9-11,13-14H2
charge 0 multiplicity 1
49 atoms
Cl -7.298759 -0.507352 -2.451962
Cl -3.60634 4.744389 1.226761
Cl 5.108365 4.122246 -0.472735
N  -4.171853 0.84601 -0.080552
N  1.613668 -1.794851 0.524962
N  5.429054 -0.998727 -1.263297
C  -0.212538 -3.096775 1.580672
C  -3.219913 -0.113805 0.332034
C  -1.269823 -2.080281 1.169798
C  1.011386 -3.127466 0.626096
C  -5.022238 0.624579 -1.263069
C  -4.363836 2.103562 0.662363
C  -2.369164 0.116011 1.455686
C  -3.073849 -1.359712 -0.35532
C  -1.425628 -0.851587 1.859257
C  -2.119376 -2.307035 0.056742
C  2.840386 -1.537675 -0.057754
C  3.349746 -0.174331 -0.134102
C  -6.265829 -0.208721 -0.897333
C  -3.340532 3.16724 0.219933
C  4.644284 0.030475 -0.751703
C  3.655382 -2.565549 -0.586714
C  2.643084 0.961692 0.3716
C  5.171542 1.359747 -0.850071
C  4.915051 -2.243058 -1.160725
C  3.168944 2.25408 0.271259
C  4.437668 2.428321 -0.348485
H  0.144997 -2.873851 2.603218
H  -0.642321 -4.11603 1.601286
H  1.759505 -3.841481 1.022109
H  0.698917 -3.499106 -0.374984
H  -4.45719 0.125972 -2.070247
H  -5.346642 1.600675 -1.664912
H  -4.287893 1.936467 1.751601
H  -5.383097 2.484018 0.473774
H  -2.437144 1.045298 2.02881
H  -3.709197 -1.602135 -1.212026
H  -0.807954 -0.647224 2.743632
H  -2.041847 -3.25054 -0.498206
H  0.9848 -1.01428 0.720401
H  -6.927037 0.31687 -0.192391
H  -6.00644 -1.20489 -0.511307
H  -3.468651 3.456322 -0.833665
H  -2.30265 2.858332 0.409464
H  3.330684 -3.608778 -0.577309
H  1.670174 0.847834 0.86458
H  6.148823 1.485855 -1.322276
H  5.537067 -3.050056 -1.568084
H  2.625413 3.1179 0.663591
