program: Gaussian 09
title: 000078059
version: EM64L-G09RevD.01
frameworkgroup: C1[X(C3H9ClO3SSi)]
method: RPBEPBE
basis: SDD
operation: Freq
keyword: #p
keyword: freq=noraman
keyword: PBEPBE/SDD
title: #p freq=noraman PBEPBE/SDD
converged: YES YES NO NO
title: Mulliken charges:
elementType: Cl S Si O O O C C C H H H H H H H H H
charge: -0.163455 1.108531 1.362451 -0.669253 -0.466540 -0.426999 -1.029609 -1.037207 -1.016286 0.277669 0.256511 0.244051 0.268553 0.273193 0.245174 0.265407 0.266216 0.241591
chargesum: 0.00000
title: Mulliken charges with hydrogens summed into heavy atoms:
elementType: Cl S Si O O O C C C
charge: -0.163455 1.108531 1.362451 -0.669253 -0.466540 -0.426999 -0.251377 -0.250286 -0.243072
polarizability: 1.25559839e+02 6.16444632e+00 1.12120187e+02 -5.41846914e-01 -7.80102774e-01 8.93631842e+01
1716.lowfreq: -7.6382 0.0005 0.0025 0.0028 5.0891 14.1307 35.8243 50.0305 96.6024
frequency: 35.1030 49.9870 96.5478 111.7444 126.0588 143.4184 156.6145 163.8403 173.1746 193.1296 202.2598 224.4598 234.5567 261.6400 291.7451 373.2443 423.1107 503.5599 604.3607 670.1300 715.2763 724.2085 765.2584 811.6077 817.7399 849.8816 923.5863 927.3384 927.9358 985.2651 1306.4289 1314.1324 1325.3754 1429.3486 1439.9273 1444.4469 1445.5514 1447.6817 1462.7041 2988.7183 2992.8053 2993.9792 3089.7136 3093.3804 3096.8485 3103.6789 3110.4088 3114.2636
redmass: 4.5056 6.6434 5.0719 1.0192 3.8076 1.1034 1.4723 1.8391 6.4527 3.2761 3.2863 3.2110 7.4657 7.3073 7.6092 11.2308 21.3875 10.4670 4.3416 13.5491 2.8030 2.8994 1.1747 1.4072 1.3897 13.2737 1.5351 1.5425 1.5366 15.2723 1.1933 1.1956 1.1819 1.0518 1.0489 1.0506 1.0483 1.0487 1.0465 1.0350 1.0354 1.0349 1.0971 1.0969 1.0972 1.0991 1.0989 1.0991
irintensity: 0.0579 0.2725 1.5942 0.0181 0.6989 0.1374 0.3966 0.6074 0.3145 0.5215 3.3341 3.4682 2.0609 4.5000 30.4846 7.8964 102.0135 42.7036 3.3353 258.1829 9.9108 18.3094 0.8692 21.4228 13.5138 98.5875 84.7310 177.6638 95.9712 88.3599 40.0727 56.0090 19.1351 1.9888 7.2337 9.4838 7.2373 4.9585 25.5570 4.0262 3.0998 6.7735 4.4069 6.6078 6.3713 5.1038 3.0041 5.8970
temp: 298.150 k
press: 1.00000 atm
elementType: 17 16 14 8 8 8 6 6 6 1 1 1 1 1 1 1 1 1
symmnumber: 1
zpe: 321114.6 jmol-1
zpe.correction: 0.122306 hartree
zpe.thermalcorrener: 0.136447 hartree
zpe.thermalcorrenthalpy: 0.137391 hartree
zpe.thermalcorrgfe: 0.080646 hartree
zpe.sumelectzpe: -1492.038223 hartree
zpe.sumelectthermal: -1492.024083 hartree
zpe.sumelectthermalent: -1492.023139 hartree
zpe.sumelectthermalfe: -1492.079884 hartree
dipole: -5.7647 1.0604 -0.5953
dipole: 5.8915
quadrupole: -74.1084 -77.8266 -80.3297
quadrupole: 0.5358 -0.6522 0.1078
quadrupole: 3.3132 -0.4051 -2.9081 0.5358 -0.6522 0.1078
hfenergy: -1492.1605296 hartree
pointgroup: C01[X(C3H9Cl1O3S1Si1)]
dipole: 2.2996593 0.065187 0.2828422 debye
dipolederiv: -0.3333943 0.0928052 -0.0326482 0.2668733 -0.7089465 0.0757802 -0.0342709 0.0631506 -0.2198272 1.9869755 -0.164167 0.1380411 -0.1756351 1.714987 -0.078349 -0.2272613 -0.059036 1.1519499 1.9255231 -0.1832083 -0.0628011 0.1149755 1.2888278 -0.0122964 0.5454272 -0.0781545 1.1835099 -1.5866097 0.1710596 -0.0944076 -0.0613875 -0.5756624 -0.0350611 -0.0902512 -0.0212383 -0.4952135 -0.5549209 0.0213531 -0.0480167 -0.0283561 -0.4672909 0.0497389 0.0847568 0.115666 -0.5786065 -0.5833243 -0.0588262 -0.0185568 -0.1070141 -0.5080897 -0.0241006 -0.0568342 -0.063997 -0.4068454 -0.4028855 0.0587353 0.0262345 0.0290792 -0.4156759 0.0824992 -0.0718515 0.0948877 -0.3883444 -0.3500694 0.038089 0.05294 0.0068034 -0.448873 -0.0660427 -0.0363666 -0.0296383 -0.3667009 -0.4477885 0.0373498 0.0932684 -0.0187556 -0.3158772 0.0161961 -0.1583505 0.0203878 -0.3541021 0.0627367 -0.0303943 0.1020214 -0.0379607 0.1184041 0.0196007 0.1221784 -0.007594 0.0210523 0.1166187 0.0003916 -0.0013732 0.0014845 -0.0733962 -0.0866424 0.0107512 -0.0666917 0.0715469 -0.0692914 -0.0016581 -0.0968283 0.0353166 0.1044728 0.0023624 -0.1119246 -0.0039693 0.076528 0.1057 0.0736135 -0.0322895 0.0571095 -0.0168363 0.0853418 -0.0141337 0.0476276 0.0596028 0.0584444 0.0100168 0.0992327 0.0111295 0.0966583 -0.0025894 0.0937574 0.0174416 0.0022924 -0.0538646 -0.0652871 -0.0764956 -0.0949822 0.1093588 -0.0247626 -0.0959947 -0.024158 0.0958299 0.1337081 0.0055744 0.0054401 0.0072505 -0.021686 -0.091759 -0.0049289 -0.1039632 0.0444815 0.1174186 0.0166312 -0.0130549 0.027016 0.0025977 0.0939611 -0.0288785 0.1118209 0.0221491 -0.1249764 -0.0220784 -0.0407061 -0.0329467 0.1170278 -0.0038775 0.0741754 -0.012542 0.0806971 unknown
polarizability: 123.0247148|-7.9178701|114.0929603|1.8499244|-3.7866618|89.9255348 unknown
InChI: InChI=1S/C3H9O3SSi.Cl/c1-8(2,3)6-7(4)5;/h1-3H3;
charge 0 multiplicity 1
18 atoms
Cl -2.081701 1.984737 -0.413717
S  -1.540289 -0.341483 -0.076693
Si 1.630993 -0.047446 0.013977
O  0.033376 -0.363497 -0.838133
O  -1.412527 -0.559402 1.516578
O  -2.546025 -1.21199 -0.963407
C  1.949479 -1.534118 1.145179
C  1.487205 1.594671 0.949192
C  2.72123 0.0170 -1.535216
H  1.180349 -1.593502 1.935325
H  1.933228 -2.478377 0.573092
H  2.937278 -1.44862 1.635406
H  1.120103 2.399371 0.289387
H  0.791096 1.505162 1.801275
H  2.475171 1.895632 1.344972
H  2.63968 -0.921784 -2.108847
H  2.414391 0.848739 -2.191704
H  3.781064 0.163305 -1.254668
