program: Gaussian 09
title: 000078055
version: EM64L-G09RevD.01
frameworkgroup: C1[X(C12H8O2)]
method: RPBEPBE
basis: SDD
operation: Freq
keyword: #pfreq=noraman
keyword: PBEPBE/SDD
title: #p freq=noraman PBEPBE/SDD
converged: NO NO NO NO
title: Mulliken charges:
elementType: O O C C C C C C C C C C C C H H H H H H H H
charge: -0.237004 -0.157398 0.102647 0.253914 -0.614832 0.180189 0.416030 -0.362298 -0.437433 0.159585 -0.396317 -0.431062 -0.243179 -0.240970 0.276543 0.276550 0.262494 0.246211 0.239138 0.244013 0.231345 0.231834
chargesum: 0.00000
title: Mulliken charges with hydrogens summed into heavy atoms:
elementType: O O C C C C C C C C C C C C
charge: -0.237004 -0.157398 0.102647 0.253914 -0.061739 0.180189 0.416030 -0.099804 -0.191222 0.159585 -0.157179 -0.187049 -0.011834 -0.009136
polarizability: 2.01812532e+02 6.01153840e+00 1.45470077e+02 1.89193309e-03 -5.00184347e-03 5.52784566e+01
1716.lowfreq: -4.9325 0.0004 0.0006 0.0007 1.6042 8.2284 82.5490 141.9142 164.3395
frequency: 82.5116 141.9116 164.3369 189.9046 226.2981 317.8470 376.7984 400.4349 414.2575 499.4014 500.3375 515.7161 542.7000 543.0380 578.4118 632.1715 659.2373 728.8099 737.1977 759.4542 779.0356 794.8315 823.8965 857.6774 878.8948 928.6183 939.5147 953.9900 972.8570 993.8925 1019.7018 1032.7730 1074.5874 1134.0280 1144.2897 1168.3810 1177.7492 1217.4406 1238.8944 1251.3167 1277.7790 1380.6100 1402.1786 1416.6153 1426.5378 1449.1169 1452.9460 1530.8239 1589.5969 1602.7817 1640.4498 1732.2387 3005.3477 3055.2139 3122.4827 3127.7929 3137.0930 3144.7466 3163.4425 3181.1371
redmass: 6.0181 4.2044 4.4097 6.1760 2.9593 5.4210 8.3999 6.0925 3.0452 6.3826 2.4506 3.3854 4.9745 3.4714 8.0321 6.9443 3.5712 6.8940 6.0964 1.2975 2.9794 7.2341 1.3944 4.2907 1.6082 7.6511 2.4051 1.3406 1.4094 1.3439 3.2080 2.9666 3.3164 1.1538 1.2852 1.6380 1.1931 1.8537 1.7729 2.4328 1.7695 2.4498 3.7125 1.5219 2.2878 3.0263 2.6939 4.8730 6.7251 7.5050 7.2870 12.8453 1.0609 1.1000 1.0858 1.0889 1.0898 1.0950 1.1004 1.0961
irintensity: 1.4851 0.6453 3.1795 0.2833 13.9393 0.3910 1.6172 1.4065 4.8544 0.3522 7.4814 1.6377 8.3271 0.3155 1.1141 7.8533 0.0023 8.3544 2.6738 38.0017 19.4994 96.8988 84.5389 3.6642 5.0360 147.1814 2.8289 0.3840 2.2331 0.1028 36.7382 49.8810 52.8638 0.8286 0.3180 23.4411 4.8097 45.1224 18.4990 45.8852 5.2493 18.4040 9.2176 9.5458 8.7787 1.0614 31.3249 29.7117 43.7022 1.8984 15.4948 453.2393 6.6741 1.1060 3.6900 0.7803 6.6021 30.7174 28.6280 3.8034
temp: 298.150 k
press: 1.00000 atm
elementType: 8 8 6 6 6 6 6 6 6 6 6 6 6 6 1 1 1 1 1 1 1 1
symmnumber: 1
zpe: 432043.8 jmol-1
zpe.correction: 0.164557 hartree
zpe.thermalcorrener: 0.174516 hartree
zpe.thermalcorrenthalpy: 0.175460 hartree
zpe.thermalcorrgfe: 0.129043 hartree
zpe.sumelectzpe: -611.590394 hartree
zpe.sumelectthermal: -611.580435 hartree
zpe.sumelectthermalent: -611.579490 hartree
zpe.sumelectthermalfe: -611.625907 hartree
dipole: -4.7856 -0.5674 0.0001
dipole: 4.8191
quadrupole: -94.4151 -68.5891 -83.0638
quadrupole: -0.3136 0.0008 -0.0009
quadrupole: -12.3924 13.4336 -1.0412 -0.3136 0.0008 -0.0009
hfenergy: -611.7549504 hartree
pointgroup: C01 [X(C12H8O2)]
dipole: -1.8859123 0.1951677 -0.0000588 debye
dipolederiv: -1.4103855 -0.2153723 0.0000169 -1.0820846 -0.8144262 0.000033 0.0000644 0.0000489 -0.1764676 -1.4581161 -0.3186984 0.0000195 -0.3867776 -0.4926581 0.0000129 -0.0000339 -0.0000087 -0.314943 -0.2267408 0.06273 -0.0000076 0.3844819 0.0076435 -0.0000162 -0.000037 -0.0000081 -0.1000918 0.2676287 -0.0999112 0.0000009 -0.1921684 -0.02812 0.0000089 0.0000063 0.000007 0.0348127 -0.2439788 0.1562074 -0.0000266 0.1548409 -0.1467661 0.0000348 -0.0000276 0.0000229 0.1560885 1.3543661 0.2315349 -0.0000124 0.0619481 0.0756074 0.0000022 0.0000229 -0.0000086 0.0765286 -0.0943726 -0.0317534 0.0000022 -0.0832913 -0.1379385 0.0000097 0.0000111 0.0000074 0.0462975 -0.2897791 -0.0338198 -0.0000001 -0.0873968 0.072451 -0.0000165 0.0000014 -0.0000084 -0.1588468 0.0994388 -0.0164407 0.000001 -0.0253822 0.1215606 -0.0000145 -0.0000031 -0.0000154 -0.1662304 1.8335534 0.3315213 -0.0000065 1.1724177 1.183912 -0.000062 -0.0000226 -0.0000457 0.2317342 -0.140209 0.0329285 -0.000005 0.0926724 0.0654826 -0.0000144 -0.0000037 -0.0000113 -0.17555 0.1024524 -0.0126252 -0.000005 0.0969019 0.1077845 -0.0000158 -0.0000116 -0.0000155 -0.1646656 -0.0184377 -0.0082156 -0.0000035 -0.0290891 0.1641433 -0.0000152 0.0000014 -0.0000175 -0.1488355 0.0715715 0.0622568 -0.0000125 0.0601067 -0.1501423 -0.0000011 -0.0000126 -0.0000021 -0.1670898 0.0575658 -0.0183439 -0.0025808 -0.0404191 0.0530879 0.0632358 0.0173675 0.0895093 0.0303776 0.0575643 -0.0183306 0.0025926 -0.0404189 0.053061 -0.0632424 -0.0173491 -0.089514 0.0304249 0.0654145 0.0736888 -0.0000029 0.0564671 0.0001155 0.00001 0.0000002 0.0000076 0.1779359 0.0175095 -0.11493 0.0000081 -0.0497225 -0.0388469 0.0000118 0.0000043 0.0000128 0.1562488 0.0329858 -0.1124475 0.0000098 -0.0565762 -0.0506788 0.000012 0.000007 0.0000122 0.1528901 0.0307317 -0.0439607 0.0000051 -0.1156451 -0.0630839 0.0000139 0.0000099 0.0000135 0.1552271 0.027676 0.0896073 -0.0000014 0.1023331 -0.0720041 0.0000095 -0.0000037 0.0000103 0.1595451 -0.1364388 0.0043744 0.0000083 0.0068019 0.0898158 0.0000035 0.0000085 0.0000033 0.1646095 unknown
polarizability: 201.9789778|-5.1703878|145.3036313|-0.0018173|-0.0050294|55.2784566 unknown
InChI: InChI=1S/C12H8O2/c13-12-7-10-9-4-2-1-3-8(9)5-6-11(10)14-12/h1-6H,7H2
charge 0 multiplicity 1
22 atoms
O  2.700169 -0.795912 0.000066
O  4.197442 0.999177 -0.000005
C  0.644449 0.339877 -0.000031
C  -0.779679 0.415512 0.000002
C  1.709409 1.412127 -0.000106
C  1.276753 -0.904333 0.000054
C  -1.516845 -0.839778 0.000088
C  0.591779 -2.143451 0.000147
C  -0.805989 -2.089349 0.000154
C  3.026014 0.609147 -0.000043
C  -1.506429 1.652084 -0.000041
C  -2.950164 -0.796332 0.000125
C  -2.902973 1.654845 0.000002
C  -3.631887 0.422266 0.000083
H  1.690571 2.070222 -0.888716
H  1.690529 2.070439 0.888337
H  1.140991 -3.088186 0.000198
H  -1.38489 -3.020148 0.000216
H  -0.953388 2.598666 -0.000105
H  -3.506454 -1.741433 0.000189
H  -3.449503 2.604434 -0.000033
H  -4.727005 0.441425 0.000115
