program: Gaussian 09
title: 000078052
version: EM64L-G09RevD.01
frameworkgroup: C1[X(C8H16O2)]
method: RPBEPBE
basis: SDD
operation: Freq
keyword: #pfreq=noraman
keyword: PBEPBE/SDD
title: #p freq=noraman PBEPBE/SDD
converged: YES YES NO NO
title: Mulliken charges:
elementType: O O C C C C C C C C H H H H H H H H H H H H H H H H
charge: -0.415418 -0.239564 -0.099893 -0.416762 -0.350424 -0.396591 -0.354064 0.140437 -0.700881 -0.697696 0.230487 0.196892 0.218972 0.204931 0.189786 0.204639 0.224341 0.199886 0.192829 0.213539 0.217765 0.228246 0.216521 0.212077 0.210116 0.369829
chargesum: 0.00000
title: Mulliken charges with hydrogens summed into heavy atoms:
elementType: O O C C C C C C C C
charge: -0.045589 -0.239564 0.130594 -0.000899 0.044294 0.032388 0.038650 0.140437 -0.041331 -0.058981
polarizability: 1.04110980e+02 4.85132335e-01 9.09787922e+01 4.11646955e-01 -1.31787696e+00 8.27198820e+01
1716.lowfreq: -10.5132 -4.5525 -0.0012 -0.0011 -0.0010 10.2497 34.1222 46.0011 67.4202
frequency: 34.0941 45.9669 67.3662 78.5663 101.0289 121.4045 172.4919 219.0997 225.0299 238.4947 269.7944 293.7564 405.7291 408.8520 492.6365 584.1455 624.9460 714.6231 729.0868 736.1251 781.4320 835.0616 884.3911 911.3862 941.6730 989.4740 1032.8616 1041.1983 1051.8744 1074.0255 1084.5014 1103.0015 1122.9493 1145.2797 1209.0768 1233.6674 1244.4718 1262.6218 1277.8669 1289.9343 1292.8433 1328.0518 1332.0275 1356.3917 1375.8322 1390.2208 1395.9719 1454.4136 1464.1381 1466.5571 1475.7634 1478.2114 1478.4467 1482.7154 1486.8083 1657.1753 2959.1373 2967.4411 2973.4281 2976.8241 2978.8609 2986.0482 2998.5961 3017.0754 3024.4267 3039.8376 3051.3203 3069.8742 3073.1670 3076.9856 3077.9115 3494.3591
redmass: 8.6948 2.4995 1.8388 2.8472 2.6024 2.2964 1.9159 1.4461 2.5345 1.2883 2.2635 3.6181 3.0449 3.1700 3.3505 3.2650 1.2544 1.7800 1.8084 1.5168 1.3405 1.4554 2.0164 1.5181 1.4522 3.9936 1.6264 2.3387 2.7303 2.0832 2.0203 2.2145 1.8165 2.4888 1.4773 1.4275 1.3366 1.2464 1.2505 1.1926 1.0866 1.4356 1.3852 1.5989 1.6515 1.2169 1.2152 1.0778 1.0752 1.0763 1.0680 1.0435 1.0495 1.0520 1.0801 7.7533 1.0588 1.0595 1.0361 1.0591 1.0361 1.0601 1.0980 1.0914 1.0983 1.1025 1.1006 1.1007 1.0994 1.1001 1.1000 1.0636
irintensity: 2.4882 0.0093 0.0571 0.1342 0.0626 0.0207 0.1952 0.6569 0.3099 0.0976 2.3465 0.0854 4.6740 6.1098 15.1748 8.6403 119.4091 32.9019 26.5497 3.4440 4.9485 1.4709 3.8742 8.9911 9.7758 10.3155 42.3944 145.4585 37.1972 21.8813 8.5388 0.2205 2.7145 23.9096 2.1471 0.8053 1.8078 2.1985 5.2163 0.5734 0.6664 1.8328 3.3627 2.7084 22.3231 9.2866 14.0902 0.3949 4.6881 5.6372 6.0379 5.7577 18.4671 12.7398 18.1828 173.5954 1.7674 30.5000 38.5808 43.6287 36.5834 40.9189 0.7018 7.8045 10.4412 4.9016 38.6897 82.2006 52.3034 59.5712 56.6700 16.2471
temp: 298.150 k
press: 1.00000 atm
elementType: 8 8 6 6 6 6 6 6 6 6 1 1 1 1 1 1 1 1 1 1 1 1 1 1 1 1
symmnumber: 1
zpe: 596702.4 jmol-1
zpe.correction: 0.227272 hartree
zpe.thermalcorrener: 0.240080 hartree
zpe.thermalcorrenthalpy: 0.241024 hartree
zpe.thermalcorrgfe: 0.186889 hartree
zpe.sumelectzpe: -464.081543 hartree
zpe.sumelectthermal: -464.068735 hartree
zpe.sumelectthermalent: -464.067791 hartree
zpe.sumelectthermalfe: -464.121926 hartree
dipole: 0.2443 -0.6872 -1.3269
dipole: 1.5141
quadrupole: -62.0233 -57.6086 -68.6278
quadrupole: -0.1165 1.9409 -1.8009
quadrupole: 0.7299 5.1446 -5.8745 -0.1165 1.9409 -1.8009
hfenergy: -464.3088152 hartree
pointgroup: C01 [X(C8H16O2)]
dipole: 0.098714 0.2824763 0.5150877 debye
dipolederiv: -0.4158179 -0.0490196 0.0977927 -0.0581036 -0.6613162 0.5331765 0.0885001 0.4374555 -0.7584144 -0.3688751 -0.0607258 -0.0594357 -0.0796878 -0.6286477 -0.220211 -0.0180298 0.020198 -0.8834642 -0.1287338 -0.0220415 0.0034664 -0.0138259 -0.2274459 -0.0088381 -0.0037369 0.0404149 0.0892002 0.0713939 0.0929257 0.0154744 0.035218 0.1067719 0.0251437 -0.026579 -0.024343 0.1116445 -0.0644308 0.0172187 0.0131059 -0.0035331 0.0901751 0.0532316 0.0380092 0.0557781 0.1397142 0.0915529 -0.0872975 -0.0086587 -0.0583339 0.1502811 0.02571 0.033217 -0.0448864 0.1042747 0.0428983 0.0161455 -0.0023729 0.055075 0.133116 0.0358426 -0.0416597 0.0333637 0.1431729 0.2446853 0.2078754 -0.0025255 0.2442266 1.2115017 -0.1589165 -0.0166032 -0.2533789 1.3007549 -0.0836274 0.002017 0.036203 0.0227961 0.052915 0.0147328 0.0201163 0.0238226 0.0760601 -0.0675778 0.0469055 -0.0248379 0.0209682 0.0538634 0.0234951 -0.0012091 0.0243242 0.0803953 0.0539547 0.0012902 -0.0071221 -0.0051605 0.0449857 0.0057701 -0.0047295 -0.0026056 -0.1223234 0.0315596 -0.0471351 -0.0058238 -0.0170641 -0.1725267 -0.0401369 0.0017006 -0.0487446 0.0610749 0.0413293 0.0050241 -0.018766 0.0113935 0.0749824 -0.0162922 -0.0007216 0.0289911 -0.1316636 0.0419916 -0.0253181 -0.0042343 -0.0353104 -0.1668101 -0.0374462 -0.0083415 -0.0591859 0.0452673 0.0329959 0.0017028 0.0122542 0.003342 0.061145 -0.0032095 -0.000141 0.0190766 -0.1830385 0.0068682 -0.0634902 -0.0090873 -0.0605426 -0.1649304 -0.0367768 -0.0162292 -0.0434417 0.0714177 0.0330798 0.0116013 0.0344364 0.0072142 0.0836701 -0.0263859 0.0026666 0.0307932 -0.1372783 0.0309042 0.0095055 -0.0361598 0.0034857 0.0679618 0.0033542 0.003808 0.02871 -0.196013 0.0244644 0.0113918 0.0008624 -0.0264908 -0.1967308 -0.0425681 -0.0037817 -0.0698813 0.0581767 0.0686961 -0.0123878 -0.0376119 -0.0168965 0.0904235 -0.0009572 0.0349812 -0.0107064 -0.1693768 -0.1017097 0.123109 -0.0322401 0.1478509 -0.0193696 0.0479881 -0.052286 0.0596286 0.072186 0.0646295 -0.0547942 0.0019623 -0.1029382 -0.1207923 -0.0518221 -0.0093831 -0.0665586 0.0592955 -0.197904 -0.055067 0.0632598 -0.0803962 0.0586665 0.0388777 0.0864427 0.0367505 0.0643523 0.082205 -0.0417322 -0.0242724 0.0255052 -0.1658421 -0.0566132 -0.018022 -0.0734068 0.0631986 0.0832841 0.0143201 0.0174613 0.0228779 0.0779402 -0.0116307 -0.0493773 0.0106674 -0.1872108 0.3821837 -0.0420236 -0.0231303 -0.0416698 0.1660125 -0.0955181 -0.0386113 -0.1528351 0.2285972 unknown
polarizability: 104.1011315|-0.6108543|90.9174388|-0.4175464|-1.5188897|82.7910835 unknown
InChI: InChI=1S/C8H16O2/c1-3-5-6-7(4-2)8(9)10/h7,9H,3-6H2,1-2H3
charge 0 multiplicity 1
26 atoms
O  -1.261037 -1.87295 0.923663
O  -1.221873 -1.384141 -1.34235
C  -0.830702 0.435477 0.292592
C  0.549821 0.89102 -0.261513
C  1.747318 0.072717 0.269968
C  -1.971023 1.37348 -0.200181
C  3.104951 0.600057 -0.247985
C  -1.11612 -0.988814 -0.15877
C  -3.353209 1.046782 0.402824
C  4.305437 -0.217706 0.274641
H  -0.804177 0.439742 1.398115
H  0.685915 1.957624 0.008436
H  0.52148 0.837314 -1.36786
H  1.6367 -0.990128 -0.027711
H  1.745837 0.088084 1.37961
H  -1.6868 2.411513 0.061637
H  -2.017516 1.318665 -1.304945
H  3.100333 0.586306 -1.356816
H  3.221807 1.662336 0.049833
H  -3.326716 1.082299 1.50784
H  -4.112712 1.771303 0.057384
H  -3.696468 0.038564 0.106288
H  5.263195 0.177503 -0.110731
H  4.227846 -1.276922 -0.035116
H  4.350092 -0.19461 1.379922
H  -1.447178 -2.787316 0.572426
