program: Gaussian 09
title: 000078037
version: EM64L-G09RevD.01
frameworkgroup: C1[X(C3H5Br)]
method: RPBEPBE
basis: SDD
operation: Freq
keyword: #pfreq=noraman
keyword: PBEPBE/SDD
title: #p freq=noraman PBEPBE/SDD
converged: NO NO NO NO
title: Mulliken charges:
elementType: Br C C C H H H H H
charge: -0.013163 -0.409609 -0.444114 -0.444114 0.287762 0.247194 0.264425 0.264426 0.247194
chargesum: 0.00000
title: Mulliken charges with hydrogens summed into heavy atoms:
elementType: Br C C C
charge: -0.013163 -0.121848 0.067505 0.067506
polarizability: 6.28059133e+01 7.45642356e-04 3.39571927e+01 -3.92764698e+00 -1.64951577e-04 3.28472751e+01
1716.lowfreq: -0.0004 -0.0002 0.0001 8.1566 13.6269 32.4525 255.7318 292.4526 506.5716
frequency: 255.7297 292.4401 506.5713 746.8880 803.0754 852.4874 924.0039 1043.1491 1054.5495 1070.0145 1089.0147 1155.3960 1209.4986 1258.9293 1434.6459 1455.8523 3097.7362 3105.0696 3172.1212 3199.8772 3216.7702
redmass: 4.0218 2.6484 3.2838 1.1235 1.2063 3.4874 3.9676 1.2146 1.2490 1.1722 1.2654 1.3815 1.7862 1.7629 1.0829 1.2356 1.0521 1.0622 1.0938 1.1164 1.1133
irintensity: 1.9066 0.1912 14.4850 3.6034 17.4039 8.7912 8.2821 34.5201 8.8075 11.7080 0.1676 0.8751 3.8262 50.2909 12.4655 10.4550 12.5025 4.6751 4.0806 0.2178 13.5102
temp: 298.150 k
press: 1.00000 atm
elementType: 35 6 6 6 1 1 1 1 1
symmnumber: 1
zpe: 185085.1 jmol-1
zpe.correction: 0.070495 hartree
zpe.thermalcorrener: 0.074919 hartree
zpe.thermalcorrenthalpy: 0.075863 hartree
zpe.thermalcorrgfe: 0.042148 hartree
zpe.sumelectzpe: -130.414101 hartree
zpe.sumelectthermal: -130.409678 hartree
zpe.sumelectthermalent: -130.408734 hartree
zpe.sumelectthermalfe: -130.442448 hartree
dipole: -2.2338 0.0000 0.3729
dipole: 2.2647
quadrupole: -31.9374 -34.4361 -32.4038
quadrupole: 0.0000 -1.8145 0.0000
quadrupole: 0.9884 -1.5104 0.5220 0.0000 -1.8145 0.0000
hfenergy: -130.4845965 hartree
pointgroup: C01 [X(C3H5Br1)]
dipole: 0.8695072 0.0002406 0.1945412 debye
dipolederiv: -0.5714457 -0.0001558 -0.010726 -0.0001219 -0.1258708 0.0000024 -0.1424606 -0.0000549 -0.1529669 0.7362423 0.0001884 0.2080858 0.0001446 0.1795172 0.0000787 0.3180561 0.0001268 0.0856195 -0.1254295 -0.1129252 0.0594742 -0.0867055 -0.1538247 0.0816871 0.0212155 0.0836776 0.0341027 -0.1256651 0.1128939 0.0595584 0.0867158 -0.1536253 -0.0817175 0.0210979 -0.0837266 0.0340316 -0.093689 -0.0000639 -0.0606792 -0.0000952 0.1303929 0.0000177 -0.0086219 0.0000276 -0.077315 -0.0259491 -0.0994359 -0.0739904 -0.0516733 0.0223463 -0.0297926 -0.061908 -0.0426155 0.0427806 0.1159531 0.0051859 -0.0538959 -0.0323423 0.0392919 0.066188 -0.0428597 0.0787265 -0.0045117 0.1159605 -0.0051248 -0.0538518 0.032442 0.0393664 -0.0662028 -0.0427099 -0.0787392 -0.0045488 -0.0259776 0.0994374 -0.0739751 0.0516357 0.022406 0.029739 -0.0618094 0.0425777 0.0428079 unknown
polarizability: 62.2876624|0.0089111|33.9571954|5.5392989|0.0020907|33.3655232 unknown
InChI: InChI=1S/C3H5Br/c4-3-1-2-3/h3H,1-2H2
charge 0 multiplicity 1
9 atoms
Br -1.933801 -0.000657 -0.185068
C  -0.081731 -0.000186 0.545818
C  1.014377 0.774138 -0.175726
C  1.01486 -0.773563 -0.175993
H  -0.128267 -0.000396 1.637246
H  1.741174 1.313709 0.440306
H  0.756341 1.271468 -1.11435
H  0.75714 -1.270733 -1.114787
H  1.742006 -1.312879 0.439854
