program: Gaussian 09
title: 000078035
version: EM64L-G09RevD.01
frameworkgroup: C1[X(C3H5N3)]
method: RPBEPBE
basis: SDD
operation: Freq
keyword: #p
keyword: freq=noraman
keyword: PBEPBE/SDD
title: #p freq=noraman PBEPBE/SDD
converged: NO NO NO YES
title: Mulliken charges:
elementType: N N N C C C H H H H H
charge: -0.319034 -0.038081 -0.664033 0.286956 -0.305384 -0.397336 0.258124 0.247895 0.326863 0.303225 0.300806
chargesum: 0.00000
title: Mulliken charges with hydrogens summed into heavy atoms:
elementType: N N N C C C
charge: 0.007828 -0.038081 -0.060002 0.286956 -0.047260 -0.149441
polarizability: 6.35139072e+01 -1.70521193e+00 5.73576667e+01 4.26274870e-03 2.16492038e-03 2.34941159e+01
1716.lowfreq: -16.4436 -0.0012 -0.0010 -0.0009 9.7479 12.1638 178.8121 216.7832 307.9335
frequency: 178.8070 216.7502 307.9307 357.3956 515.8098 610.3974 661.2142 674.1977 714.2057 791.1993 906.6261 980.2137 1015.1626 1031.1920 1121.9739 1227.9347 1308.4581 1338.6849 1387.3303 1453.2296 1609.0566 1642.9184 3217.2909 3233.7749 3590.3627 3630.0745 3726.8373
redmass: 1.2122 1.0356 5.6389 2.7381 1.6705 1.7957 2.2122 5.7135 1.8497 1.4274 6.0587 2.5653 1.3548 3.0434 2.0677 1.5816 2.3389 5.2366 2.8519 2.1327 2.5957 1.5171 1.0971 1.0994 1.0449 1.0823 1.1043
irintensity: 351.0418 1.2136 1.7228 4.5531 69.7774 2.5049 95.5032 1.4339 27.6861 63.7677 13.3494 23.5744 4.5714 12.7574 18.3916 3.7114 28.0969 25.7561 6.7381 5.3414 42.0709 193.6088 4.7887 2.5287 43.6360 69.6564 24.5545
temp: 298.150 k
press: 1.00000 atm
elementType: 7 7 7 6 6 6 1 1 1 1 1
symmnumber: 1
zpe: 223994.9 jmol-1
zpe.correction: 0.085315 hartree
zpe.thermalcorrener: 0.091086 hartree
zpe.thermalcorrenthalpy: 0.092030 hartree
zpe.thermalcorrgfe: 0.056535 hartree
zpe.sumelectzpe: -281.094147 hartree
zpe.sumelectthermal: -281.088376 hartree
zpe.sumelectthermalent: -281.087432 hartree
zpe.sumelectthermalfe: -281.122928 hartree
dipole: -2.2065 -2.2659 0.0005
dipole: 3.1628
quadrupole: -27.9853 -29.8387 -39.6806
quadrupole: -6.1015 -0.0011 0.0000
quadrupole: 4.5163 2.6628 -7.1791 -6.1015 -0.0011 0.0000
hfenergy: -281.1794626 hartree
pointgroup: C01 [X(C3H5N3)]
dipole: -0.9290316 0.8278058 -0.0002114 debye
dipolederiv: -0.3679608 -0.4036151 -0.0000331 -0.2819336 -0.235514 -0.0000032 -0.0001353 -0.0000418 -0.2238632 -0.3468863 0.3290076 0.0000331 0.3011024 0.0377401 0.0000164 0.000067 -0.0000159 -0.1972762 -1.2567191 -0.1386616 0.0001582 -0.0394505 -0.1054428 0.0000718 0.000314 0.0001008 -0.8059606 1.3310725 0.1595202 -0.0001951 0.0650712 -0.1094809 -0.0000441 -0.0001823 -0.0000392 0.1149427 0.0699144 0.2904442 0.000008 -0.1965167 -0.1360205 0.0000342 -0.0000069 0.0000139 -0.3016804 -0.1493642 -0.2761924 -0.0000253 0.1250918 0.179099 0.0000245 0.0000254 0.0000866 -0.2266358 0.0759533 0.0378607 0.0000167 0.0434914 -0.0327848 -0.0000172 0.000023 -0.000021 0.2650361 0.0796973 -0.0358149 0.0000073 -0.041347 -0.0470299 -0.0000232 0.0000048 -0.0000342 0.2008362 0.2216493 0.024818 0.0000232 0.0132253 0.1955786 -0.0000077 0.000063 0.0000212 0.3506292 0.1806045 0.0134095 0.0000049 0.0234644 0.1357194 -0.0000559 -0.000086 -0.0000948 0.4112192 0.1620392 -0.0007762 0.000002 -0.0121987 0.1181357 0.0000045 -0.0000867 0.0000242 0.4127528 unknown
polarizability: 63.2422563|2.1228053|57.6293177|-0.0044053|0.0018577|23.4941159 unknown
InChI: InChI=1S/C3H5N3/c4-3-1-5-6-2-3/h1-2,5H,4H2
charge 0 multiplicity 1
11 atoms
N  1.34391 0.709186 0.00014
N  1.456177 -0.664018 0.0000
N  -2.171964 -0.092432 0.000496
C  -0.778256 -0.00542 0.00029
C  0.023029 1.156697 0.000268
C  0.15634 -1.098813 0.000119
H  -0.239557 2.211867 0.00034
H  -0.051943 -2.167872 0.000018
H  2.190751 1.271323 0.000008
H  -2.629694 -0.996928 0.000279
H  -2.751394 0.73941 0.000442
