program: Gaussian 09
title: 000078036
version: EM64L-G09RevD.01
frameworkgroup: C1[X(C9H11ClS)]
method: RPBEPBE
basis: SDD
operation: Freq
keyword: #p
keyword: freq=noraman
keyword: PBEPBE/SDD
title: #p freq=noraman PBEPBE/SDD
converged: YES YES NO NO
title: Mulliken charges:
elementType: Cl S C C C C C C C C C H H H H H H H H H H H
charge: -0.056520 0.199152 0.487388 -0.817405 -0.561365 -0.370892 -0.380226 -0.219439 -0.220022 -0.563466 -0.236464 0.259001 0.262715 0.274364 0.246137 0.237396 0.233428 0.227349 0.226934 0.274573 0.267713 0.229648
chargesum: 0.00000
title: Mulliken charges with hydrogens summed into heavy atoms:
elementType: Cl S C C C C C C C C C
charge: -0.056520 0.199152 0.487388 -0.295689 -0.040864 -0.133496 -0.146798 0.007910 0.006912 -0.021180 -0.006815
polarizability: 1.72513567e+02 8.31258074e+00 1.10012983e+02 -1.44325823e+01 6.08827809e+00 8.52862129e+01
1716.lowfreq: -8.6788 -0.2341 -0.0015 0.0015 0.0020 9.3607 13.1781 32.0546 41.3179
frequency: 12.1493 31.9867 41.2408 51.5553 104.5272 153.1204 220.2057 265.1981 325.9464 386.7516 402.0848 477.5851 552.1012 600.4668 617.1351 631.7943 661.1875 701.2156 776.6296 806.4430 851.1013 867.5525 896.8395 925.0381 941.5050 976.2091 989.8278 996.0575 1026.8675 1049.1992 1071.6238 1117.8580 1127.1856 1172.9070 1179.4448 1187.7576 1220.2432 1238.6255 1293.4259 1304.6068 1325.6923 1385.8250 1431.8237 1440.5222 1440.9757 1459.0249 1484.5311 1594.4988 1614.0597 2992.0255 3009.3796 3050.1643 3074.0295 3081.3795 3121.2935 3124.4006 3134.8859 3136.8239 3148.2819 3165.0390
redmass: 5.6339 3.9840 5.7792 5.5723 6.6501 6.4581 2.8079 3.6602 2.3183 3.5051 2.7979 3.6962 5.5148 5.6787 6.3385 3.9632 4.0933 1.6386 2.1418 3.8022 1.2499 1.6421 1.5107 1.4619 1.4996 1.3918 5.6422 1.3489 2.1967 2.4800 1.4928 1.0502 1.0819 1.0516 1.2474 1.1127 2.0433 1.4459 1.2131 1.2373 1.2765 8.6679 1.0919 2.0637 1.1315 1.1147 2.3631 6.1061 6.1545 1.0593 1.0567 1.0586 1.1025 1.1084 1.0856 1.0875 1.1102 1.0920 1.0964 1.1017
irintensity: 0.2527 1.5578 1.5183 2.4000 0.5747 0.8757 0.2574 1.2677 0.6622 6.6811 0.0230 5.3274 3.5951 12.9818 0.1320 22.0723 19.3525 63.1889 26.2723 3.8687 0.0381 23.4493 6.1184 4.0554 4.0963 0.0192 0.1913 0.0928 6.9539 11.1999 8.4246 1.8579 1.8108 0.0465 0.8639 0.8190 1.4547 33.2343 25.4899 8.3464 0.1139 0.1870 11.7856 11.2971 4.7515 4.6027 14.1947 1.0725 2.0497 29.9592 25.6292 27.2911 22.7547 4.0276 5.6902 1.4268 11.5421 15.1222 41.5994 21.5818
temp: 298.150 k
press: 1.00000 atm
elementType: 17 16 6 6 6 6 6 6 6 6 6 1 1 1 1 1 1 1 1 1 1 1
symmnumber: 1
zpe: 457379.4 jmol-1
zpe.correction: 0.174207 hartree
zpe.thermalcorrener: 0.185869 hartree
zpe.thermalcorrenthalpy: 0.186813 hartree
zpe.thermalcorrgfe: 0.132217 hartree
zpe.sumelectzpe: -1206.849677 hartree
zpe.sumelectthermal: -1206.838015 hartree
zpe.sumelectthermalent: -1206.837071 hartree
zpe.sumelectthermalfe: -1206.891666 hartree
dipole: 1.0074 -2.8587 1.8761
dipole: 3.5646
quadrupole: -77.9979 -75.4218 -79.2998
quadrupole: 10.9379 -6.6857 2.4820
quadrupole: -0.4247 2.1514 -1.7266 10.9379 -6.6857 2.4820
hfenergy: -1207.0238838 hartree
pointgroup: C01[X(C9H11Cl1S1)]
dipole: -0.3129182 -1.0009009 -0.9311867 debye
dipolederiv: -0.3245236 -0.0980625 -0.0839277 -0.2051481 -0.403057 -0.1444646 -0.1246782 -0.1040027 -0.2453689 -0.3690901 0.0163392 -0.0152215 0.0694767 -0.1278536 0.070845 0.0188004 0.0630382 -0.034581 0.2025391 -0.0219174 -0.0381346 -0.0753316 -0.024599 -0.0178325 -0.1368893 -0.020922 -0.0606101 0.3783863 0.0506706 0.1152863 0.0534884 0.154341 0.0135418 0.1802652 0.0210754 0.1716666 0.2382375 -0.0326604 -0.144062 -0.1899287 0.0242325 -0.0720665 -0.3830457 -0.0575869 0.0021687 -0.0772525 0.0596602 -0.0729329 0.0455904 -0.0046783 -0.0783429 -0.0247679 -0.0710316 -0.0956601 -0.0974795 -0.0804606 -0.0125545 -0.0338855 0.0431702 -0.0467123 -0.0020712 -0.0526336 -0.1261435 -0.0617637 -0.0878344 -0.0134765 -0.1025639 0.0896665 -0.052888 0.0015827 -0.0427353 -0.1162136 -0.0413778 0.0642745 -0.0816106 0.0885618 0.0199797 -0.0857742 -0.0773329 -0.0941836 -0.0697001 0.2280852 0.1712781 0.0847362 0.2966859 0.5437998 0.1928372 0.3500553 0.1931637 0.279891 0.0274652 -0.0457185 -0.093524 -0.0392085 -0.0632979 -0.0175266 -0.0787942 -0.017682 -0.1140787 -0.0389892 0.0086661 -0.0119035 0.0103448 -0.118323 -0.08566 -0.0657319 -0.0383404 0.0297434 -0.0390342 -0.0113726 0.0039122 -0.047308 0.0330923 0.0831538 -0.0303739 0.037778 -0.1087602 -0.0551687 0.008222 0.0460782 0.0290545 0.030484 0.1035978 0.1087218 0.0735766 -0.065358 -0.0355298 -0.0643175 -0.0302082 0.0467336 -0.0807902 -0.09266 0.0139408 -0.1060237 0.0217953 0.0489149 -0.0718315 0.085662 -0.0690657 0.0132296 0.0720932 0.0726991 0.0795964 0.0757097 0.066279 0.1046379 0.0101275 0.0894677 -0.058491 0.0407757 0.0034729 0.0310988 0.1217634 0.0455739 0.0845934 0.01145 0.1067285 -0.0774825 0.0502514 0.0125698 0.0507823 0.1321591 0.02447 -0.0632412 0.0781735 -0.0767426 -0.0109206 0.0955444 0.0940974 0.0935437 0.0843284 0.1217839 -0.0654483 0.0215064 -0.0413932 -0.0691937 0.039212 -0.0461771 0.0435447 -0.0305114 -0.1455501 0.0254792 0.0480641 -0.0074413 -0.0002923 -0.0737637 0.0166671 -0.0877463 0.0319138 -0.0959759 0.0490437 0.0925596 0.0518847 0.0869833 0.005839 0.0969898 0.0056901 0.1158464 unknown
polarizability: 174.047577|-2.8685579|110.9390729|-11.784421|-2.4547999|82.8261131 unknown
InChI: InChI=1S/C9H11ClS/c10-6-7-11-8-9-4-2-1-3-5-9/h1-5H,6-8H2
charge 0 multiplicity 1
22 atoms
Cl 4.85816 1.14368 0.913976
S  1.616953 0.016384 0.324646
C  -1.07899 -0.229832 -0.447772
C  0.306798 -0.533349 -0.964832
C  3.153487 -0.452418 -0.682792
C  -1.667486 1.043682 -0.661888
C  -1.81056 -1.208705 0.272991
C  -2.961082 1.330259 -0.172965
C  -3.10474 -0.924814 0.763153
C  4.390712 -0.542658 0.197981
C  -3.684413 0.34589 0.540557
H  0.449682 -1.614134 -1.136515
H  0.523145 0.018895 -1.895377
H  3.29501 0.27897 -1.496532
H  2.970794 -1.452276 -1.123602
H  -1.105366 1.81093 -1.207752
H  -1.361568 -2.193205 0.452235
H  -3.403886 2.317276 -0.347329
H  -3.659081 -1.691067 1.316608
H  4.238691 -1.200605 1.066572
H  5.272983 -0.858387 -0.380618
H  -4.688443 0.567184 0.919557
