program: Gaussian 09
title: 000078061
version: EM64L-G09RevD.01
frameworkgroup: C1[X(C10H16O4)]
method: RPBEPBE
basis: SDD
operation: Freq
keyword: #pfreq=noraman
keyword: PBEPBE/SDD
title: #p freq=noraman PBEPBE/SDD
converged: NO YES NO NO
title: Mulliken charges:
elementType: O O O O C C C C C C C C C C H H H H H H H H H H H H H H H H
charge: -0.415455 -0.416319 -0.254850 -0.252970 0.419811 -0.471817 -0.478476 -0.415056 -0.429882 -0.386458 -0.584431 -0.604147 0.178183 0.178319 0.233059 0.186470 0.194804 0.235925 0.206023 0.200226 0.202685 0.203974 0.187687 0.205698 0.307322 0.249681 0.309876 0.259002 0.375711 0.375407
chargesum: 0.00000
title: Mulliken charges with hydrogens summed into heavy atoms:
elementType: O O O O C C C C C C C C C C
charge: -0.039744 -0.040913 -0.254850 -0.252970 0.419811 -0.052288 -0.047747 -0.008807 -0.023224 0.006928 -0.027428 -0.035269 0.178183 0.178319
polarizability: 1.23088397e+02 -3.67381820e+00 1.15322342e+02 3.47506399e+00 -1.06672142e+00 1.06408424e+02
1716.lowfreq: -16.7664 -2.2758 -0.0004 0.0005 0.0007 12.4966 27.1650 34.3877 61.8216
frequency: 27.1139 34.3724 61.8193 90.3307 125.8704 139.9776 193.1540 235.4476 257.6753 290.3175 299.4355 317.2425 367.2553 369.6322 443.7216 459.5964 485.8904 505.6213 511.5215 562.7334 603.7460 621.7561 649.1853 654.4832 762.1080 783.8170 822.4151 835.1782 847.8188 862.7934 890.8602 899.8911 933.3191 938.6858 973.2984 1005.1901 1040.0008 1057.7343 1060.8585 1081.6727 1104.9639 1109.4816 1133.3384 1164.5384 1197.0627 1218.8387 1231.7693 1249.1452 1259.4266 1267.0407 1293.0772 1309.0650 1327.5052 1337.0411 1342.5273 1349.2787 1355.9760 1364.0330 1368.8765 1430.8899 1441.9874 1466.1422 1469.3351 1476.3713 1480.5345 1486.2841 1646.1209 1659.1302 2960.1343 2965.1438 2965.4632 2972.6282 2976.1873 2986.4199 2987.6623 3027.5021 3028.2435 3035.1437 3037.6240 3044.0600 3051.2377 3074.9026 3503.7350 3504.4933
redmass: 7.2066 8.4705 8.9092 4.5241 3.7394 3.1913 3.1873 3.2661 3.0679 2.7067 3.0247 3.7938 1.9099 2.6683 2.6253 2.6919 2.0713 2.0276 2.0406 2.5893 3.6625 2.6454 1.4503 1.5199 3.4900 1.5145 2.6465 2.8308 1.8651 3.2682 2.5610 2.6420 1.9903 1.6431 2.2956 2.0790 2.2186 1.9087 2.0893 1.6021 1.8667 1.8261 1.7153 1.5004 2.0719 1.3372 1.1811 1.5855 1.4192 1.3471 1.4907 1.6965 1.3345 1.3770 1.5475 1.5554 1.5948 1.4697 1.7907 1.0933 1.0930 1.0882 1.0833 1.0863 1.0797 1.0937 7.8527 7.3774 1.0646 1.0653 1.0635 1.0626 1.0626 1.0628 1.0658 1.0955 1.0971 1.0973 1.0991 1.1020 1.0962 1.0910 1.0638 1.0638
irintensity: 0.8701 0.6349 1.2483 0.4881 0.6557 0.6659 7.7221 1.4920 1.0233 0.6234 2.2975 5.0283 2.9184 3.4430 1.6656 1.3867 17.0230 35.2806 31.7521 41.8325 35.4179 12.2798 94.1441 148.4306 0.0503 0.0897 1.8439 1.1251 8.3883 1.8845 30.6794 21.9938 19.6562 2.8796 13.3367 105.0894 358.3992 28.9426 67.0054 33.4019 4.5693 15.6414 3.4572 1.6369 19.8188 2.6079 0.9389 0.6079 5.6821 1.7516 17.6550 0.8406 1.5983 5.3985 20.9662 27.4734 75.7318 1.8671 46.5453 36.7722 33.3371 6.7338 8.5813 5.6882 36.7106 3.2735 25.1717 312.1387 13.9264 35.4328 33.6090 26.3421 28.7990 12.7098 47.7237 72.9825 63.8856 9.3607 12.4362 85.2899 20.2463 6.6924 24.6078 20.1214
temp: 298.150 k
press: 1.00000 atm
elementType: 8 8 8 8 6 6 6 6 6 6 6 6 6 6 1 1 1 1 1 1 1 1 1 1 1 1 1 1 1 1
symmnumber: 1
zpe: 656533.9 jmol-1
zpe.correction: 0.250061 hartree
zpe.thermalcorrener: 0.264144 hartree
zpe.thermalcorrenthalpy: 0.265088 hartree
zpe.thermalcorrgfe: 0.208139 hartree
zpe.sumelectzpe: -690.480530 hartree
zpe.sumelectthermal: -690.466446 hartree
zpe.sumelectthermalent: -690.465502 hartree
zpe.sumelectthermalfe: -690.522452 hartree
dipole: -1.0037 -0.6565 0.1443
dipole: 1.2080
quadrupole: -79.6567 -77.5867 -90.8864
quadrupole: -2.2793 -1.1745 -1.6272
quadrupole: 3.0532 5.1232 -8.1765 -2.2793 -1.1745 -1.6272
hfenergy: -690.7305906 hartree
pointgroup: C01 [X(C10H16O4)]
dipole: -0.442026 0.1673353 -0.0499791 debye
polarizability: 120.9854014|4.647591|116.9049393|-3.9986241|-2.5482484|106.9288224 unknown
InChI: InChI=1S/C10H16O4/c11-8(12)6-10(7-9(13)14)4-2-1-3-5-10/h11,13H,1-7H2
charge 0 multiplicity 1
30 atoms
O  2.925773 2.174725 -0.904625
O  0.400244 -3.179302 1.089963
O  2.265336 1.258102 1.112565
O  1.173835 -2.265426 -0.888328
C  -0.314029 0.311788 -0.210194
C  -1.332685 -0.176169 -1.289423
C  -0.950451 1.50498 0.574272
C  -2.728695 -0.509595 -0.712474
C  -2.357116 1.200491 1.145141
C  -3.323318 0.700704 0.046565
C  0.957457 0.801802 -0.96549
C  0.033915 -0.82409 0.800937
C  2.060361 1.399247 -0.117086
C  0.589065 -2.101529 0.209292
H  -0.915183 -1.0465 -1.83029
H  -1.451735 0.634228 -2.039298
H  -1.035466 2.36194 -0.12727
H  -0.270766 1.821833 1.387909
H  -2.66555 -1.381667 -0.03055
H  -3.402496 -0.810857 -1.537805
H  -2.760911 2.115173 1.620776
H  -2.288652 0.441013 1.949983
H  -3.508879 1.522876 -0.675998
H  -4.303073 0.435265 0.488472
H  1.400227 -0.050357 -1.519697
H  0.67775 1.556288 -1.723663
H  0.795126 -0.439259 1.50986
H  -0.842824 -1.097755 1.410245
H  3.66479 2.517675 -0.330992
H  0.819152 -3.994122 0.698201
