program: Gaussian 09
title: 000077987
version: EM64L-G09RevD.01
frameworkgroup: C1[X(C8H6)]
method: RPBEPBE
basis: SDD
operation: Freq
keyword: #p
keyword: freq=noraman
keyword: PBEPBE/SDD
title: #p freq=noraman PBEPBE/SDD
converged: NO NO NO NO
title: Mulliken charges:
elementType: C C C C C C C C H H H H H H
charge: 0.196739 0.196750 -0.331606 -0.331608 -0.374269 -0.374270 -0.222613 -0.222612 0.261340 0.261340 0.247437 0.247437 0.222967 0.222967
chargesum: 0.00000
title: Mulliken charges with hydrogens summed into heavy atoms:
elementType: C C C C C C C C
charge: 0.196739 0.196750 -0.070266 -0.070268 -0.126832 -0.126832 0.000354 0.000355
polarizability: 1.10293275e+02 -1.41074711e-04 8.92177715e+01 7.14811191e-04 3.80762067e-04 3.33687646e+01
1716.lowfreq: -7.0550 -0.0010 -0.0008 -0.0005 11.3745 16.0811 230.5609 290.1362 362.3324
frequency: 230.5597 290.1356 362.3320 402.7355 533.2070 571.6139 640.2783 717.5235 750.3708 763.9409 792.8299 849.6939 869.3453 899.9503 919.6117 967.1191 970.3473 1024.8755 1040.4316 1083.0370 1089.9167 1175.1394 1215.5925 1273.2362 1401.7129 1416.0404 1484.6728 1500.0772 1608.5884 1667.9377 3125.2705 3140.5094 3151.5626 3163.8822 3184.4494 3221.7921
redmass: 3.9462 3.1058 2.7240 3.5492 6.5311 3.1598 6.7283 1.1849 1.2564 5.2167 4.3130 3.9592 1.3384 1.3948 1.4269 1.3169 3.0029 4.4071 1.1351 1.6774 2.7291 1.1002 1.5298 1.3970 2.2461 1.9946 6.9928 5.7915 7.9648 7.8861 1.0850 1.0912 1.0951 1.0998 1.0869 1.1171
irintensity: 16.6567 0.0000 5.6813 4.7328 0.0485 0.0000 1.1050 4.1104 170.5570 0.0000 0.0094 0.9924 0.0000 0.0000 12.7145 0.0000 5.0164 0.1222 4.3640 2.8382 0.1010 0.0041 13.6482 4.2636 15.4544 5.2725 4.3095 2.0519 0.3734 0.9396 0.2750 15.3638 32.0310 19.9553 1.2438 14.1597
temp: 298.150 k
press: 1.00000 atm
elementType: 6 6 6 6 6 6 6 6 1 1 1 1 1 1
symmnumber: 1
zpe: 284115.0 jmol-1
zpe.correction: 0.108214 hartree
zpe.thermalcorrener: 0.114041 hartree
zpe.thermalcorrenthalpy: 0.114985 hartree
zpe.thermalcorrgfe: 0.078674 hartree
zpe.sumelectzpe: -307.811652 hartree
zpe.sumelectthermal: -307.805825 hartree
zpe.sumelectthermalent: -307.804881 hartree
zpe.sumelectthermalfe: -307.841192 hartree
dipole: -0.4302 0.0000 0.0003
dipole: 0.4302
quadrupole: -39.3744 -39.9940 -51.4260
quadrupole: 0.0000 -0.0002 0.0003
quadrupole: 4.2237 3.6041 -7.8278 0.0000 -0.0002 0.0003
hfenergy: -307.9198659 hartree
pointgroup: C01 [X(C8H6)]
dipole: 0.1692578 0.000002 -0.0001163 debye
dipolederiv: 0.1090137 -0.0901095 -0.000004 0.1626341 -0.1085955 -0.0000291 -0.0000915 -0.000007 -0.0125461 0.109016 0.0901211 -0.0000102 -0.1626069 -0.1085989 0.0000077 -0.0001106 -0.0000078 -0.0125463 -0.0174423 0.0832429 -0.000022 -0.048247 0.016596 0.0000047 0.0000205 0.0000357 -0.188213 -0.0174199 -0.0832492 -0.0000337 0.0482234 0.0166016 0.0000018 0.0000724 0.0000091 -0.1882088 -0.1173642 0.0313608 0.0000276 0.0374829 0.1568388 -0.000017 0.0000963 -0.0000368 -0.1644489 -0.1173536 -0.031374 0.0000219 -0.0375049 0.1568357 0.0000117 0.0000135 -0.0000026 -0.1644488 0.0833989 0.0037198 0.0000161 -0.0618094 -0.0457735 -0.0000016 0.0000135 0.0000302 -0.1814768 0.0833992 -0.0037111 -0.0000039 0.0618232 -0.0457715 0.0000062 0.0000018 -0.0000116 -0.1814772 -0.0525258 -0.0789606 0.0000241 -0.0849681 0.0499441 0.0000149 0. -0.0000134 0.2040392 -0.0525327 0.0789573 0.0000062 0.0849696 0.0499485 0.0000021 0.0000147 -0.0000131 0.2040372 0.0919997 -0.0061681 -0.0000066 0.0008169 -0.1062435 0.0000107 -0.0000111 0.0000207 0.1768415 0.0919989 0.0061779 -0.000005 -0.0008058 -0.1062444 -0.0000084 0.0000007 0.0000065 0.1768416 -0.0970994 0.0924457 -0.0000063 0.0936969 0.0372365 0.000002 -0.000019 -0.0000045 0.1658032 -0.0970885 -0.0924529 -0.0000043 -0.0937049 0.0372263 -0.0000057 -0.0000013 -0.0000056 0.1658033 unknown
polarizability: 110.2932749|0.0006827|89.2177715|0.0007148|-0.0003807|33.3687646 unknown
InChI: InChI=1S/C8H6/c1-2-4-8-6-5-7(8)3-1/h1-6H
charge 0 multiplicity 1
14 atoms
C  0.508594 0.720993 0.000068
C  0.508636 -0.720942 0.000039
C  2.053243 0.6912 -0.00015
C  2.053268 -0.691075 -0.000028
C  -0.655528 1.466172 -0.000019
C  -0.655448 -1.466183 -0.000098
C  -1.888102 0.700627 -0.000056
C  -1.888063 -0.700707 -0.000097
H  2.835307 1.451653 -0.000271
H  2.835368 -1.451492 -0.000043
H  -0.67539 2.560822 -0.000091
H  -0.675253 -2.560833 -0.000136
H  -2.84535 1.234587 -0.000092
H  -2.845281 -1.234719 -0.000128
