program: Gaussian 09
title: 000077981
version: EM64L-G09RevD.01
frameworkgroup: C1[X(C13H8)]
method: RPBEPBE
basis: SDD
operation: Freq
keyword: #p
keyword: freq=noraman
keyword: PBEPBE/SDD
title: #p freq=noraman PBEPBE/SDD
converged: NO NO NO NO
title: Mulliken charges:
elementType: C C C C C C C C C C C C C H H H H H H H H
charge: 0.338390 -0.392984 -0.392987 -0.218735 -0.218731 -0.239055 -0.042004 -0.041356 0.012154 -0.756310 0.037713 -0.028359 -0.027561 0.251437 0.251437 0.231663 0.231662 0.232542 0.257059 0.257000 0.257022
chargesum: 0.00000
title: Mulliken charges with hydrogens summed into heavy atoms:
elementType: C C C C C C C C C C C C C
charge: 0.338390 -0.141546 -0.141550 0.012928 0.012931 -0.006512 -0.042004 -0.041356 0.012154 0.014771 0.037713 -0.028359 -0.027561
polarizability: 4.67680012e+02 1.25708410e-01 9.90425125e+01 -9.84108912e-02 3.15063151e-03 5.50596332e+01
1716.lowfreq: -3.2717 -0.0003 0.0003 0.0008 3.5070 16.8308 31.4950 38.2495 46.7984
frequency: 31.4767 38.2484 46.0993 91.6754 100.0733 186.0763 195.0243 278.4633 287.9164 313.1787 360.5496 400.5018 436.4152 456.2008 494.1124 501.0141 519.4330 543.5859 559.4808 616.6678 694.4242 735.6563 772.5345 851.5086 928.7143 961.1435 980.9976 985.2086 999.7109 1022.0001 1022.6440 1025.4549 1078.4304 1174.1308 1186.6331 1202.4736 1311.4236 1366.5187 1392.8477 1406.2636 1430.7079 1453.5669 1453.8603 1487.9114 1569.2959 1601.0395 2118.0687 2230.5178 2259.7345 2967.0248 3055.9744 3056.5332 3127.7127 3137.4006 3149.6307 3159.4719 3169.5367
redmass: 4.9437 5.3184 1.0336 5.0890 5.1332 5.2451 5.5997 6.4548 5.1612 5.6569 6.1182 2.8292 8.9079 7.7642 9.6735 8.7830 10.0301 4.3886 6.7655 6.6163 1.8589 5.9035 1.7269 1.2471 1.4280 6.6110 1.3837 6.3604 1.3256 1.3840 1.3865 2.0967 1.6183 1.0571 1.1658 3.9884 1.4110 5.2354 1.5300 2.4423 2.3407 1.0408 1.0408 2.9195 5.5548 5.9646 11.8940 11.9891 11.8328 1.0347 1.0982 1.0982 1.0850 1.0883 1.0930 1.0969 1.1015
irintensity: 1.9598 2.5736 0.0002 1.3666 0.6988 2.2141 1.8915 0.5373 3.0052 3.3951 0.1125 0.0001 0.0041 2.0034 0.5846 0.7095 0.2836 9.1027 17.9225 0.0573 45.3959 0.0814 69.8283 0.0000 6.0030 0.5817 0.0000 0.4972 0.2166 5.8216 6.0983 10.7493 8.1467 0.0004 0.8873 3.0871 0.0730 0.0002 4.4635 0.1401 8.3056 14.8129 14.8624 24.0697 1.4740 10.8053 2.0402 0.0033 41.9392 46.5777 9.4537 9.3751 1.8201 4.0048 20.5348 27.3084 28.5041
temp: 298.150 k
press: 1.00000 atm
elementType: 6 6 6 6 6 6 6 6 6 6 6 6 6 1 1 1 1 1 1 1 1
symmnumber: 1
zpe: 406628.0 jmol-1
zpe.correction: 0.154876 hartree
zpe.thermalcorrener: 0.167412 hartree
zpe.thermalcorrenthalpy: 0.168356 hartree
zpe.thermalcorrgfe: 0.114067 hartree
zpe.sumelectzpe: -499.174756 hartree
zpe.sumelectthermal: -499.162221 hartree
zpe.sumelectthermalent: -499.161277 hartree
zpe.sumelectthermalfe: -499.215566 hartree
dipole: -0.4952 0.0007 -0.0003
dipole: 0.4952
quadrupole: -32.1788 -68.9306 -79.0098
quadrupole: -0.0040 0.0025 0.0008
quadrupole: 27.8610 -8.8908 -18.9701 -0.0040 0.0025 0.0008
hfenergy: -499.3296326 hartree
pointgroup: C01 [X(C13H8)]
dipole: 0.194812 -0.0002797 -0.0001189 debye
dipolederiv: 0.5071247 0.0001632 0.0001203 0.0000157 0.0379253 0. -0.000014 0.0000001 0.0504571 -0.2144237 0.0903527 0.000117 -0.0592396 0.0507158 0.00011 0.0000096 -0.0001854 -0.151802 -0.2144264 -0.090065 0.0001258 0.0592079 0.0503915 -0.0001392 -0.000007 0.0001415 -0.1522088 -0.0310688 -0.1091448 0.0001054 -0.1740029 0.0720735 -0.0002595 0.0000152 0.000225 -0.1414875 -0.031112 0.1093761 0.0000892 0.1739886 0.0727138 0.0002271 -0.0000066 -0.0002468 -0.1409012 -0.0632959 -0.0002739 -0.0002298 0.0000023 -0.0394322 -0.0000084 -0.0000057 -0.0000064 -0.1608437 0.136916 -0.0001807 -0.0001692 0.0000214 -0.1076723 0.0000041 -0.0000015 0.0000014 -0.0565344 -0.0893395 -0.0001791 -0.0001305 -0.0000129 -0.0346811 -0.0000009 0.0000136 -0.0000007 -0.040309 0.0549449 0.0002402 0.0001556 0.0001829 -0.0285547 0.0000002 0.0000215 0.0000001 -0.0256769 -0.1070883 0.00057 0.0004874 -0.0336976 0.0816195 -0.0000048 -0.0268207 -0.0000037 0.082523 0.4623433 -0.0003194 -0.000273 0.0164595 -0.1273795 -0.0000044 0.013295 -0.0000093 -0.1306796 0.3465678 -0.0002298 -0.0001398 -0.0005949 -0.0131892 -0.0000038 -0.0002797 -0.0000038 -0.0204698 -0.4491844 0.0002101 0.0001351 0.0002062 -0.0348708 0.0000029 0.0001349 0.0000034 -0.031037 0.0764568 -0.0833627 -0.0000551 -0.073009 -0.0288692 0.0000665 -0.0000023 -0.0000419 0.1585511 0.0764349 0.0832204 -0.0000652 0.0730232 -0.0289807 -0.000039 -0.0000043 0.0000845 0.1583898 -0.0159754 0.0853758 0.0000266 0.1298478 -0.0645514 0.0000365 -0.000005 0.0000195 0.1602189 -0.015951 -0.0852859 0.0000416 -0.1298412 -0.0646296 -0.0000044 0.000008 0.0000019 0.1602429 -0.1513971 -0.0000072 0.0000103 -0.0000249 0.0893195 0.0000071 0.0000016 0.0000073 0.1628294 -0.0801497 0.0533091 0.0122092 0.1021859 -0.0477099 -0.0420897 0.0292548 -0.0419679 0.1270451 -0.103831 -0.016314 -0.0530685 -0.023319 0.1191776 -0.0545987 -0.101636 -0.0544317 -0.0406173 -0.0935454 -0.0374552 0.0405079 -0.0613995 0.0465841 0.0966983 0.0860287 0.096413 0.0323099 unknown
polarizability: 467.6800102|0.1288148|99.0425147|0.0984109|-0.0031498|55.0596332 unknown
InChI: InChI=1S/C13H8/c1-2-3-4-5-7-10-13-11-8-6-9-12-13/h6,8-9,11-12H,1H3
charge 0 multiplicity 1
21 atoms
C  -2.215336 0.000139 0.00002
C  -2.940675 1.230076 -0.000056
C  -2.940503 -1.229898 0.00008
C  -4.350628 1.22462 -0.000084
C  -4.350453 -1.224631 0.000121
C  -5.061456 -0.000053 0.000028
C  -0.785949 0.000233 0.000013
C  0.462224 0.000291 0.000009
C  1.820717 0.000413 0.000026
C  7.144296 -0.000022 -0.000088
C  5.679479 0.000099 -0.000049
C  3.072872 0.000422 0.000009
C  4.434753 0.000227 0.000011
H  -2.389789 2.17644 -0.000132
H  -2.3895 -2.176192 0.000143
H  -4.8962 2.174792 -0.000152
H  -4.895905 -2.174872 0.000195
H  -6.157295 -0.000148 0.000041
H  7.542096 -1.006505 -0.229868
H  7.54276 0.304121 0.986262
H  7.542494 0.70205 -0.756829
