program: Gaussian 09
title: 000078347
version: EM64L-G09RevD.01
frameworkgroup: C1[X(C17H16N6O9)]
method: RPBEPBE
basis: SDD
operation: Freq
keyword: #p
keyword: freq=noraman
keyword: PBEPBE/SDD
title: #p freq=noraman PBEPBE/SDD
converged: YES YES NO NO
title: Mulliken charges:
elementType: O O O O O O O O O N N N N N N C C C C C C C C C C C C C C C C C H H H H H H H H H H H H H H H H
charge: -0.186456 -0.162049 -0.162033 -0.194310 -0.194316 -0.192550 -0.192554 -0.194240 -0.194236 -0.250741 -0.250787 -0.015545 -0.015553 0.021285 0.021285 0.117734 0.383703 0.383837 -0.329958 -0.329967 0.347772 0.347791 -0.310826 -0.310932 -0.667817 -0.667815 -0.525817 -0.525755 -0.420771 -0.420764 0.437912 0.437932 0.268109 0.226867 0.268114 0.226838 0.275508 0.275450 0.227000 0.215703 0.267695 0.227005 0.215706 0.267702 0.327091 0.327089 0.300330 0.300334
chargesum: 0.00000
title: Mulliken charges with hydrogens summed into heavy atoms:
elementType: O O O O O O O O O N N N N N N C C C C C C C C C C C C C C C C C
charge: -0.186456 -0.162049 -0.162033 -0.194310 -0.194316 -0.192550 -0.192554 -0.194240 -0.194236 -0.250741 -0.250787 -0.015545 -0.015553 0.021285 0.021285 0.117734 0.383703 0.383837 0.165017 0.164985 0.347772 0.347791 -0.035318 -0.035482 0.042582 0.042598 -0.198726 -0.198666 -0.120440 -0.120430 0.437912 0.437932
polarizability: 3.72889909e+02 6.38784030e-02 2.24055865e+02 -3.78232391e-03 5.40913021e+00 2.62279968e+02
1716.lowfreq: -10.8756 -0.0003 0.0005 0.0008 0.5218 4.3277 13.3249 16.2188 23.3940
frequency: 8.1661 15.1809 23.3764 30.2515 46.1779 51.5779 52.5095 63.3116 66.3036 79.0676 86.9576 87.7234 108.8466 125.1501 129.2570 145.4064 151.6694 153.0669 154.2918 163.8068 197.4531 199.1248 217.2322 225.4525 274.6649 279.4098 298.4563 301.4406 307.7784 328.3573 348.4996 357.3926 372.5731 391.3959 401.4159 432.4637 447.5641 466.7154 469.6184 487.8685 504.9608 506.3519 524.4308 540.3681 588.6917 596.3028 608.5296 638.2928 639.8494 658.8257 675.3738 678.1768 697.2378 707.7731 709.7750 711.6516 738.7417 740.0502 744.7129 754.7961 755.7008 765.7592 817.1074 845.3473 845.5354 864.1779 866.2381 926.3731 940.6202 949.9811 950.1169 961.5979 989.8467 990.4252 1028.2986 1055.1747 1060.9680 1083.5662 1090.6278 1097.9715 1113.7781 1120.8356 1126.7207 1145.5539 1148.8718 1169.5780 1201.5881 1207.1059 1207.2863 1220.8943 1224.7785 1254.6243 1259.5848 1270.9056 1272.0051 1326.7138 1337.7589 1356.2009 1358.4275 1363.9281 1366.0168 1366.7317 1369.9151 1391.6085 1391.8176 1393.3993 1394.1148 1426.4040 1426.4635 1462.3016 1464.8620 1469.8817 1470.4599 1476.9363 1478.5047 1482.5143 1483.3382 1576.6058 1578.3464 1590.6853 1603.8191 1619.6996 2995.1960 2995.2595 3039.9381 3040.0912 3084.3407 3084.3834 3103.3353 3103.5234 3120.0001 3120.2001 3172.6886 3172.7668 3183.4733 3183.5210 3189.8155 3189.8638
redmass: 2.6425 2.6026 12.5382 8.9534 8.3628 5.0271 9.4376 7.6922 3.9414 8.2230 14.9201 13.4918 6.5014 9.4857 9.0687 6.3775 7.9596 8.2563 8.9950 7.5491 1.5315 1.1264 4.2286 2.5280 5.7362 6.3850 6.7160 5.3926 6.4657 10.5475 4.2346 4.2184 4.3133 3.9879 4.2960 3.5556 6.4925 5.3110 7.4598 5.1787 8.0769 7.4915 6.3282 3.7653 5.0609 5.5345 4.4335 7.9273 7.8937 5.7424 7.4567 8.5389 8.0886 8.8207 7.9099 8.2976 4.0425 5.1449 1.7267 11.3824 6.6929 1.3377 2.1176 1.5204 1.5147 6.4838 5.6833 3.3119 3.2861 1.4609 1.4865 2.4508 1.3612 1.3584 3.5894 2.4393 2.1531 2.4300 1.9921 2.2402 3.9152 6.1661 2.2187 1.4918 1.3824 1.9643 7.0691 9.0679 4.0178 10.1223 3.5378 1.7597 3.0320 1.4740 1.4716 1.5650 1.7470 4.0671 2.1520 2.6935 5.7886 5.9441 1.8956 4.8219 8.7711 1.2237 1.3938 5.2811 5.7122 1.0849 1.0434 1.1130 1.2239 2.0510 2.6676 1.0765 1.0878 8.8646 9.0115 7.5836 6.9671 7.8229 1.0363 1.0363 1.0626 1.0626 1.1001 1.1001 1.0990 1.0990 1.1029 1.1029 1.0890 1.0890 1.0926 1.0926 1.0969 1.0969
irintensity: 0.8200 0.0417 0.1024 1.3201 1.0487 0.4549 0.0481 0.9258 4.6814 7.5942 0.4248 1.2469 0.8350 7.7963 0.0173 2.1569 0.0051 9.5027 0.2245 0.9865 1.8481 0.0614 0.2456 3.2717 1.9370 0.1814 2.5256 0.0537 0.7156 3.6781 0.0458 0.1587 1.8238 4.7748 11.4070 0.8062 8.4417 0.0613 19.9006 0.8624 0.5267 1.7663 5.7094 13.4705 4.2169 11.3375 5.8319 0.1530 15.1921 8.7907 16.2301 21.7075 31.0654 2.9566 2.9641 43.3996 0.1073 0.1781 2.7703 19.8669 7.0301 1.2244 26.2277 2.6554 54.5839 12.4737 12.1228 11.4432 6.3072 27.4321 2.7034 21.4250 5.6934 0.5962 20.4925 20.3975 25.4191 0.2783 49.9469 86.5772 31.2760 0.0089 158.7768 12.1117 50.3201 47.3514 354.5740 568.1089 141.9901 101.9666 197.6131 56.2377 55.5979 23.1882 2.8073 55.2145 76.1847 1.8997 101.4516 199.4117 29.8318 48.6695 52.0773 75.1981 4.0092 8.8402 11.8473 4.7422 25.8668 64.1892 6.1884 13.2373 5.8912 35.6524 97.0151 34.5182 31.8408 0.0694 34.5027 543.3455 55.5784 0.5201 33.4866 4.6134 2.4494 22.0554 20.4540 26.3298 13.1516 5.7872 10.7021 7.9764 0.5252 1.1014 15.6921 13.2947 1.6087 7.6688
temp: 298.150 k
press: 1.00000 atm
elementType: 8 8 8 8 8 8 8 8 8 7 7 7 7 7 7 6 6 6 6 6 6 6 6 6 6 6 6 6 6 6 6 6 1 1 1 1 1 1 1 1 1 1 1 1 1 1 1 1
symmnumber: 1
zpe: 880136.1 jmol-1
zpe.correction: 0.335226 hartree
zpe.thermalcorrener: 0.365239 hartree
zpe.thermalcorrenthalpy: 0.366184 hartree
zpe.thermalcorrgfe: 0.270069 hartree
zpe.sumelectzpe: -1660.273229 hartree
zpe.sumelectthermal: -1660.243216 hartree
zpe.sumelectthermalent: -1660.242271 hartree
zpe.sumelectthermalfe: -1660.338386 hartree
dipole: -3.8264 -0.0036 -0.0001
dipole: 3.8264
quadrupole: -231.0791 -196.7943 -180.7908
quadrupole: -0.0177 0.0130 -18.9263
quadrupole: -28.1910 6.0937 22.0973 -0.0177 0.0130 -18.9263
hfenergy: -1660.608455 hartree
pointgroup: C01 [X(C17H16N6O9)]
dipole: 1.5054186 -0.0007903 0.0000839 debye
polarizability: 372.8899337|0.0005981|228.6734819|0.0169835|-13.5809242|257.6623262 unknown
InChI: InChI=1S/C17H16N6O9/c1-3-18(13-7-5-11(20(25)26)9-15(13)22(29)30)17(24)19(4-2)14-8-6-12(21(27)28)10-16(14)23(31)32/h5-10H,3-4H2,1-2H3
charge 0 multiplicity 1
48 atoms
O  3.824301 -0.00054 0.000275
O  2.314206 2.601589 -0.940459
O  2.312732 -2.601822 0.941364
O  0.648215 2.251487 -2.461649
O  0.646391 -2.250617 2.461998
O  -4.170294 2.796855 1.675137
O  -4.170606 -2.7964 -1.676711
O  -3.655122 3.579488 -0.409696
O  -3.656529 -3.578498 0.4086
N  1.813106 0.500867 1.097726
N  1.812938 -0.501273 -1.097188
N  1.109271 2.266489 -1.25405
N  1.107848 -2.266122 1.254532
N  -3.367788 2.940277 0.67456
N  -3.368478 -2.939923 -0.675837
C  2.569599 -0.000493 0.000323
C  0.556289 1.146247 0.9734
C  0.555823 -1.146235 -0.973181
C  2.562991 0.606086 2.39653
C  2.562775 -0.606544 -2.396011
C  0.166119 1.932152 -0.159441
C  0.165156 -1.931977 0.159546
C  -0.406481 1.006321 2.015964
C  -0.406431 -1.006395 -2.016225
C  3.15213 2.011065 2.611972
C  3.151713 -2.011583 -2.611598
C  -1.115972 2.494824 -0.278758
C  -1.117033 -2.494547 0.278418
C  -1.675889 1.595729 1.936821
C  -1.675919 -1.5957 -1.937538
C  -2.023885 2.32856 0.779674
C  -2.024459 -2.328346 -0.780439
H  3.365892 -0.146186 2.351536
H  1.885312 0.320085 3.218303
H  3.365771 0.14563 -2.351042
H  1.885091 -0.320449 -3.217757
H  -0.16314 0.382559 2.879336
H  -0.162536 -0.382977 -2.879683
H  3.701962 2.03711 3.569899
H  2.362839 2.782963 2.649529
H  3.85202 2.262217 1.798922
H  3.701499 -2.037568 -3.569551
H  2.362326 -2.783379 -2.649196
H  3.851613 -2.262924 -1.798614
H  -1.394036 3.073572 -1.163653
H  -1.395538 -3.073125 1.16328
H  -2.410558 1.474572 2.737076
H  -2.410238 -1.474722 -2.738143
