program: Gaussian 09
title: 000078029
version: EM64L-G09RevD.01
frameworkgroup: C1[X(C11H12NO3S)]
method: RPBEPBE
basis: SDD
operation: Freq
keyword: #p
keyword: freq=noraman
keyword: PBEPBE/SDD
title: #p freq=noraman PBEPBE/SDD
converged: YES YES NO NO
title: Mulliken charges:
elementType: S O O O N C C C C C C C C C C C H H H H H H H H H H H H
charge: 1.025144 -0.551344 -0.433183 -0.430525 -0.105507 0.229512 -0.097663 -0.392624 0.390845 -0.130297 -0.238080 -0.292774 -0.349646 -0.641226 -0.214533 -0.220595 0.257167 0.285448 0.317047 0.294593 0.282582 0.272989 0.271797 0.263854 0.234925 0.273728 0.277793 0.420572
chargesum: 1.00000
title: Mulliken charges with hydrogens summed into heavy atoms:
elementType: S O O O N C C C C C C C C C C C
charge: 1.025144 -0.130771 -0.433183 -0.430525 -0.105507 0.229512 -0.097663 0.149991 0.390845 0.186750 0.056512 -0.010192 -0.076657 0.129350 0.059195 0.057198
polarizability: 2.36955834e+02 -4.91070856e+00 1.67116054e+02 -2.61344510e+00 7.36409857e+00 8.85223773e+01
1716.lowfreq: -10.0618 -3.0396 -0.0026 -0.0023 -0.0022 7.7930 53.3530 58.7269 94.6429
frequency: 53.3465 58.7199 94.6357 136.7274 144.3029 162.4340 178.9719 188.1107 203.4325 214.6917 259.5984 276.3364 312.3544 325.5385 355.9326 372.2006 403.1206 422.9984 472.8326 493.2759 509.5211 538.7368 546.8656 557.9826 582.9347 662.5086 683.4191 767.2432 780.7311 786.3361 815.5144 826.5049 843.8681 859.7527 896.2017 955.7251 977.9533 983.2893 1006.6129 1015.2715 1018.3706 1036.2687 1050.0306 1086.6466 1088.2593 1155.7333 1161.6315 1166.3872 1194.5249 1224.4467 1257.4768 1288.4925 1301.3368 1343.5710 1394.7537 1402.7253 1420.5627 1435.3088 1450.2250 1465.7825 1480.3075 1517.1417 1528.7457 1564.6627 1578.8662 1619.7398 3007.8623 3065.0289 3103.6757 3114.0570 3134.5837 3157.1942 3163.0002 3166.3781 3178.3627 3185.9523 3202.3336 3466.5770
redmass: 6.1332 6.1579 3.7530 3.0948 7.5616 6.6419 2.6519 1.1957 5.5793 5.5813 4.6812 2.0145 2.2854 8.5005 4.4195 3.0165 9.8531 3.5046 3.6380 4.2036 3.9587 4.2759 9.3142 5.3919 5.5421 4.7965 4.9798 1.3894 2.1161 1.9071 2.6026 4.0969 12.3851 1.3180 1.5100 2.6416 1.3459 15.2522 1.3934 3.7101 1.4166 2.3805 1.1834 2.1377 2.1088 2.0758 1.6114 1.4607 1.2413 1.6298 1.5947 1.6767 1.5351 1.3491 2.7116 1.2174 5.3165 2.2183 2.3321 1.0419 1.0480 3.7577 1.1070 5.7148 6.5677 6.3641 1.0366 1.0642 1.1002 1.0990 1.1035 1.0899 1.0909 1.0918 1.0983 1.0981 1.0959 1.0666
irintensity: 0.5084 0.6237 0.4657 0.3149 2.7362 0.5841 2.5609 0.8891 1.5125 5.2877 8.4762 41.5621 96.1721 7.3433 8.8963 2.5388 87.3884 12.2227 4.6432 4.4459 8.0318 18.6091 65.2269 14.9477 44.6396 6.3082 11.6574 41.4793 13.4265 14.0899 3.3844 8.2770 67.2627 30.3583 29.4308 1.1092 1.6549 78.2481 0.5243 5.8569 0.2592 1.5823 85.2418 33.1923 1.9962 19.4672 10.5110 3.1717 2.5465 2.3585 10.8675 9.0295 3.1787 6.9404 9.8659 23.8531 33.2620 12.3644 5.5587 16.6343 6.8707 112.3254 30.2984 40.9167 13.7628 23.7278 4.6916 4.8940 10.9273 3.2698 1.3109 0.1263 6.8908 0.7705 20.5144 0.9556 0.1592 130.6054
temp: 298.150 k
press: 1.00000 atm
elementType: 16 8 8 8 7 6 6 6 6 6 6 6 6 6 6 6 1 1 1 1 1 1 1 1 1 1 1 1
symmnumber: 1
zpe: 555686.6 jmol-1
zpe.correction: 0.211650 hartree
zpe.thermalcorrener: 0.226896 hartree
zpe.thermalcorrenthalpy: 0.227840 hartree
zpe.thermalcorrgfe: 0.169796 hartree
zpe.sumelectzpe: -1103.259197 hartree
zpe.sumelectthermal: -1103.243950 hartree
zpe.sumelectthermalent: -1103.243006 hartree
zpe.sumelectthermalfe: -1103.301050 hartree
dipole: -6.3630 0.4008 1.7209
dipole: 6.6038
quadrupole: -58.9913 -76.0042 -99.7965
quadrupole: 4.2825 9.7146 4.1411
quadrupole: 19.2727 2.2598 -21.5325 4.2825 9.7146 4.1411
hfenergy: -1103.4708464 hartree
pointgroup: C01 [X(C11H12N1O3S1)]
dipole: 2.504003 -0.286347 0.6310802 debye
polarizability: 236.3421512|-8.4253373|167.9023463|-0.3863173|-6.5437477|88.3497673 unknown
InChI: InChI=1S/C11H12NO3S/c1-2-12-10-6-4-3-5-9(10)7-8-11(12)16(13,14)15/h3-8,13H,2H2,1H3
charge 1 multiplicity 1
28 atoms
S  -2.944506 0.432543 -0.001669
O  -2.962061 0.019366 1.793945
O  -3.515969 1.911086 -0.274167
O  -3.430911 -0.830717 -0.873327
N  -0.191609 -0.474241 0.15811
C  1.212032 -0.285351 0.092253
C  -1.008326 0.60038 -0.001476
C  -0.739401 -1.875667 0.381886
C  1.727036 1.056985 -0.113327
C  -0.563884 1.913322 -0.207038
C  0.81683 2.141888 -0.2595
C  2.121965 -1.372309 0.231744
C  3.144426 1.261901 -0.166394
C  -0.779729 -2.700527 -0.916137
C  3.499767 -1.13014 0.174747
C  4.01958 0.186954 -0.023478
H  -0.106899 -2.336329 1.15698
H  -1.743964 -1.776197 0.817056
H  -1.300448 2.713547 -0.321069
H  1.197946 3.156502 -0.413268
H  1.773948 -2.395811 0.374758
H  3.524294 2.277159 -0.319794
H  -1.491256 -2.266198 -1.636547
H  -1.137583 -3.715146 -0.668697
H  0.209159 -2.7960 -1.394845
H  4.192391 -1.970607 0.282586
H  5.101231 0.342823 -0.062279
H  -3.90296 0.024187 2.141046
