program: Gaussian 09
title: 000077953
version: EM64L-G09RevD.01
frameworkgroup: C1[X(C6H12N2)]
method: RPBEPBE
basis: SDD
operation: Freq
keyword: #pfreq=noraman
keyword: PBEPBE/SDD
title: #p freq=noraman PBEPBE/SDD
converged: YES YES NO NO
title: Mulliken charges:
elementType: N N C C C C C C H H H H H H H H H H H H
charge: -0.140539 -0.094312 -0.348695 -0.415618 -0.481238 0.220704 -0.629589 -0.788005 0.213159 0.211703 0.221480 0.200864 0.202138 0.225943 0.218845 0.220350 0.252259 0.219854 0.270024 0.220673
chargesum: 0.00000
title: Mulliken charges with hydrogens summed into heavy atoms:
elementType: N N C C C C C C
charge: -0.140539 -0.094312 0.076167 0.006726 -0.053157 0.220704 0.061865 -0.077454
polarizability: 9.12225322e+01 5.06036013e+00 8.28628358e+01 -1.36424478e+00 2.55431809e-01 5.70261416e+01
1716.lowfreq: -18.8421 -12.1062 0.0007 0.0008 0.0009 9.8678 78.4292 94.7765 170.1712
frequency: 78.3457 94.6287 170.1683 209.3744 250.7964 304.6897 355.3103 393.6159 457.8516 484.2168 572.4806 640.9918 682.1616 852.1221 869.8164 880.2267 917.4678 1007.3043 1038.6991 1072.7748 1081.4797 1092.7307 1118.1833 1170.7188 1179.3194 1208.3806 1222.1220 1273.7677 1311.0856 1334.9517 1348.7791 1380.1268 1392.3442 1440.2819 1454.7236 1458.3157 1463.8380 1469.4876 1482.8926 1485.4342 1503.5220 1609.3599 2919.7142 2926.6944 2955.6493 2979.4500 2992.3435 3007.3845 3011.0337 3028.1511 3057.8191 3062.6188 3114.1185 3129.8408
redmass: 2.1564 1.2798 2.2211 2.3602 1.1202 1.7622 2.3693 2.7344 3.1907 3.4385 3.6079 2.3695 4.8279 2.2741 2.0185 1.6052 2.5998 1.4889 1.5461 1.8525 2.5234 1.5836 1.4415 2.3995 1.3914 1.4733 2.8139 1.3578 1.3880 1.5059 1.5153 1.2928 1.9895 1.1336 1.1139 1.1235 1.0725 1.0644 1.0632 1.0581 1.1401 5.5568 1.0617 1.0546 1.0676 1.0388 1.0707 1.0841 1.0898 1.0925 1.0979 1.1043 1.0935 1.0964
irintensity: 0.2190 0.8446 8.4797 2.7248 0.0960 8.4042 0.9027 2.7794 0.9253 0.4216 3.7716 6.6221 1.2455 2.5035 3.2647 4.1447 16.0347 21.7731 4.9436 14.5356 17.3777 5.6549 3.6791 3.8093 8.5827 17.8214 31.7228 1.5585 71.9866 17.0527 14.6546 17.1882 63.9802 15.0051 12.5700 16.9125 10.7858 17.4570 4.9463 0.9191 23.6942 211.9730 30.0154 154.1022 68.4847 30.0208 13.4325 74.2827 35.3345 62.0857 23.3914 53.4274 19.4728 9.2820
temp: 298.150 k
press: 1.00000 atm
elementType: 7 7 6 6 6 6 6 6 1 1 1 1 1 1 1 1 1 1 1 1
symmnumber: 1
zpe: 460560.5 jmol-1
zpe.correction: 0.175418 hartree
zpe.thermalcorrener: 0.184005 hartree
zpe.thermalcorrenthalpy: 0.184950 hartree
zpe.thermalcorrgfe: 0.142383 hartree
zpe.sumelectzpe: -344.676018 hartree
zpe.sumelectthermal: -344.667431 hartree
zpe.sumelectthermalent: -344.666487 hartree
zpe.sumelectthermalfe: -344.709054 hartree
dipole: 0.8630 3.3521 0.1115
dipole: 3.4632
quadrupole: -44.0043 -53.3823 -50.1874
quadrupole: -1.3450 -0.2237 0.6343
quadrupole: 5.1871 -4.1910 -0.9961 -1.3450 -0.2237 0.6343
hfenergy: -344.8514366 hartree
pointgroup: C01 [X(C6H12N2)]
dipole: 0.3686001 -1.3092175 -0.0809805 debye
dipolederiv: -0.6157918 -0.0027904 0.0002068 0.3661695 -1.1763835 -0.0576165 -0.0929542 0.1116334 -0.3317199 -0.8061545 0.3044141 -0.0005533 0.2908023 -0.7036861 0.0595697 0.0142099 0.0074464 -0.3960796 0.2679458 0.3201145 0.076856 0.1728127 0.2754632 0.0255455 0.0781809 0.0225232 0.3664387 -0.0726417 0.0144834 0.0163503 -0.0049644 -0.0561132 0.0417239 0.0120699 0.0237476 0.0987147 0.4671741 -0.0847895 0.0011068 0.0186472 0.1433494 -0.0316445 -0.0282536 -0.0064532 0.300307 0.7177566 -0.2013663 0.0803449 -0.4822383 1.3802907 -0.0110389 0.0912083 0.0034127 0.0443108 0.3845579 -0.2963235 -0.0853516 -0.2594063 0.3073913 0.0450126 -0.0614954 -0.0134121 0.3216391 -0.1679119 -0.1397495 -0.0331815 -0.074898 -0.0903647 -0.0185352 -0.0379999 -0.0241334 0.0823816 0.0411868 0.0453774 -0.0370346 -0.0022768 -0.1838491 0.0744267 -0.0223126 0.1088145 0.0240046 -0.0026149 -0.0735756 0.0007478 -0.0289334 0.0102872 -0.0301227 -0.0499048 -0.1402975 -0.2053403 0.0811994 0.0292268 -0.038144 0.0274308 0.048291 -0.018924 0.03063 0.0126347 -0.1617136 -0.1454135 -0.1206975 -0.0275278 -0.1607151 -0.0065272 -0.0194047 -0.0413555 -0.031948 0.0817841 -0.0356745 0.0131085 -0.0403135 -0.1027297 0.0753521 -0.0159265 -0.1332711 0.0346391 -0.1782922 -0.128546 0.1004282 0.0519305 0.095208 -0.025118 -0.048498 0.1252757 -0.0561308 0.0467789 -0.0229184 0.0928057 0.0200483 0.10831 -0.0070578 -0.0481886 0.1513592 -0.1432534 -0.1813506 0.0675545 -0.0320539 0.049387 0.0874784 -0.1629977 0.1046713 0.0111385 0.1263616 0.0107592 -0.0760984 -0.0472089 -0.0433419 -0.1156979 0.0755391 -0.0617478 -0.052821 -0.0496293 0.0699882 -0.0119928 -0.0039175 -0.0830059 0.0306416 0.0803699 0.0861206 -0.1229521 0.0535088 -0.070569 0.1251317 0.0834428 0.0041109 -0.0018811 -0.0743034 -0.0100239 0.0002943 -0.0002959 0.1184716 -0.0667483 -0.0009285 0.0873649 0.0362404 0.0900669 -0.065399 0.1289535 -0.0391683 -0.0405132 unknown
polarizability: 91.3685229|-4.9471553|82.6072036|1.8745155|1.0528493|57.135783 unknown
InChI: InChI=1S/C6H12N2/c1-6-7-4-3-5-8(6)2/h3-5H2,1-2H3
charge 0 multiplicity 1
20 atoms
N  0.599936 -0.703608 0.045263
N  -0.532358 1.44306 -0.057632
C  -0.648202 -1.460633 -0.190988
C  -1.859921 -0.678668 0.350823
C  -1.837998 0.754851 -0.226413
C  0.557933 0.70677 0.053391
C  1.841194 -1.475087 -0.082499
C  1.874357 1.444729 0.234246
H  -0.560976 -2.442277 0.315166
H  -0.78029 -1.664271 -1.277796
H  -1.794007 -0.630855 1.454086
H  -2.797029 -1.203705 0.087633
H  -2.091914 0.730111 -1.307794
H  -2.610595 1.378289 0.260386
H  2.058409 -1.755037 -1.137205
H  1.763132 -2.410495 0.505102
H  2.700514 -0.907916 0.303972
H  2.377013 1.169075 1.180588
H  1.641506 2.518903 0.256373
H  2.581095 1.251263 -0.594602
