program: Gaussian 09
title: 000077992
version: EM64L-G09RevD.01
frameworkgroup: C1[X(C14H17N3O)]
method: RPBEPBE
basis: SDD
operation: Freq
keyword: #p
keyword: freq=noraman
keyword: PBEPBE/SDD
title: #p freq=noraman PBEPBE/SDD
converged: YES YES NO NO
title: Mulliken charges:
elementType: O N N N C C C C C C C C C C C C C C H H H H H H H H H H H H H H H H H
charge: -0.286924 -0.474533 -0.307867 -0.642875 -0.081816 -0.544195 -0.446825 0.146890 -0.515008 0.188963 0.137507 0.211256 -0.536387 -0.357700 0.332836 -0.640823 -0.385522 0.112196 0.221916 0.207235 0.220686 0.235159 0.205074 0.230671 0.220862 0.301622 0.245502 0.201517 0.232950 0.195437 0.224019 0.225234 0.277412 0.313335 0.332197
chargesum: 0.00000
title: Mulliken charges with hydrogens summed into heavy atoms:
elementType: O N N N C C C C C C C C C C C C C C
charge: -0.286924 -0.172912 -0.062365 0.002656 0.140100 -0.116274 -0.006592 0.146890 -0.063475 0.188963 0.137507 0.211256 -0.334870 -0.124750 0.332836 0.003867 -0.108110 0.112196
polarizability: 2.55427668e+02 1.28387459e+01 1.91402041e+02 -2.98755140e+00 4.93595339e+00 9.43456053e+01
1716.lowfreq: -29.3540 -6.2339 -0.0007 -0.0007 -0.0005 2.8177 7.7443 53.1017 59.4147
frequency: -29.2715 53.0009 59.4113 86.9401 108.0718 146.5015 168.1255 183.2172 199.5305 238.3070 258.1197 295.2946 315.8495 327.6798 353.7439 398.7189 406.2852 448.2823 450.1160 465.1334 471.9420 514.6378 523.7728 539.5119 558.0545 602.9947 606.7673 626.9858 636.9772 678.7295 710.4952 735.5839 759.6915 788.8389 816.2075 834.2305 837.7124 871.2734 882.3092 911.9144 963.0370 978.8822 985.5352 1000.2302 1041.8477 1051.2891 1092.5866 1101.1512 1116.5072 1124.6572 1131.9466 1138.5230 1156.2226 1167.2283 1197.0940 1228.5055 1239.9587 1244.5371 1274.4517 1283.3714 1300.5844 1311.1124 1324.9987 1338.9242 1357.7025 1365.1574 1415.2368 1434.6285 1441.3536 1452.7051 1457.3040 1463.1328 1466.4306 1471.1551 1474.7360 1478.9519 1497.1678 1568.5594 1585.0546 1600.8377 1630.0205 1633.1087 2884.5577 2936.4613 2953.2197 2965.7151 2978.7272 3003.8973 3007.0717 3012.1029 3063.7708 3070.1532 3117.5756 3134.6303 3165.9731 3435.5160 3534.9854 3602.9251 3688.6203
redmass: 4.5179 3.5359 3.6361 3.7550 2.9649 3.0821 2.9037 2.2115 1.9760 2.3210 2.4460 5.1856 3.4274 4.3609 5.2109 2.1486 2.8731 2.8563 2.6781 1.4915 3.5492 1.2489 3.5789 1.5406 4.0808 2.2696 3.6858 1.5439 4.0514 3.9539 3.9653 4.3312 3.3745 4.6937 2.5561 2.1894 1.5152 1.8299 2.9917 1.6228 2.5657 1.3332 2.5252 2.0307 2.1451 2.1279 2.3972 2.3250 1.5551 1.6237 1.4200 1.2350 3.1542 2.5793 1.4894 1.4404 1.6365 1.7249 1.3391 2.0290 1.3459 1.8362 1.3141 1.8972 2.3900 2.2907 5.2072 1.1298 2.6510 1.2145 1.1404 1.3638 2.6759 1.1689 1.1257 4.0899 1.0442 3.8437 3.6236 5.9239 1.8318 6.4927 1.0548 1.0657 1.0615 1.0765 1.0749 1.0956 1.0924 1.0771 1.0978 1.0999 1.0903 1.0895 1.0949 1.0740 1.0447 1.0804 1.1036
irintensity: 17.1943 0.2176 0.4624 1.9388 1.7932 0.8298 2.8242 10.8882 0.8492 5.9304 3.6410 0.4393 0.5584 0.4579 0.3980 3.3048 7.0614 8.4901 13.7779 124.8342 11.4401 60.9826 3.1005 128.6610 15.0512 11.4881 12.1563 134.1449 18.5225 0.9529 2.2704 58.3586 9.0146 0.9786 9.7063 2.1171 25.3146 26.6914 2.0424 0.8911 2.6627 1.2384 2.9452 14.2382 1.3692 9.8240 0.1199 8.1774 0.8288 30.0248 23.1284 0.6548 11.7252 45.8076 9.1347 0.6765 15.5442 0.9005 4.3260 5.1564 1.8694 50.8554 17.3434 15.9101 186.0682 164.7018 0.2751 5.8404 28.9272 22.6538 1.4729 7.7337 12.6661 6.6328 6.8524 58.5579 17.8926 167.1095 25.5606 3.3103 217.5386 39.9879 100.5944 40.4747 54.4641 6.7010 37.9842 8.5144 87.3068 46.4597 44.0574 40.9857 21.4923 10.6113 6.3543 1.1282 31.8812 54.4149 29.7242
temp: 298.150 k
press: 1.00000 atm
elementType: 8 7 7 7 6 6 6 6 6 6 6 6 6 6 6 6 6 6 1 1 1 1 1 1 1 1 1 1 1 1 1 1 1 1 1
symmnumber: 1
zpe: 759708.2 jmol-1
zpe.correction: 0.289358 hartree
zpe.thermalcorrener: 0.304820 hartree
zpe.thermalcorrenthalpy: 0.305764 hartree
zpe.thermalcorrgfe: 0.247104 hartree
zpe.sumelectzpe: -781.884661 hartree
zpe.sumelectthermal: -781.869198 hartree
zpe.sumelectthermalent: -781.868254 hartree
zpe.sumelectthermalfe: -781.926914 hartree
dipole: -5.4442 -0.0771 0.4415
dipole: 5.4626
quadrupole: -139.2459 -78.0017 -108.8014
quadrupole: 4.1735 -1.7183 2.8141
quadrupole: -30.5629 30.6813 -0.1184 4.1735 -1.7183 2.8141
hfenergy: -782.1740183 hartree
pointgroup: C01 [X(C14H17N3O1)]
dipole: 2.1428498 -0.0160731 0.1635147 debye
polarizability: 255.9818523|11.4091624|190.8449261|2.0783241|-5.3035535|94.3485353 unknown
InChI: InChI=1S/C14H17N3O/c1-16-9-3-5-13-11(7-9)10-6-8(14(15)18)2-4-12(10)17-13/h2,4,6,9,16-17H,3,5,7,15H2,1H3
charge 0 multiplicity 1
35 atoms
O  -5.229139 -0.773298 0.023913
N  0.390175 2.394942 -0.135741
N  4.364018 -1.67011 0.154726
N  -3.768021 -2.551664 0.184403
C  3.359483 -0.635797 -0.17726
C  1.893471 -0.997228 0.238787
C  3.788825 0.710375 0.461196
C  0.984719 0.200336 0.095708
C  2.921951 1.901881 -0.026598
C  1.472622 1.501439 -0.015075
C  -0.463711 0.281637 0.043561
C  -0.808593 1.676173 -0.102162
C  -1.502119 -0.678456 0.104061
C  -2.148959 2.112093 -0.180981
C  -2.850903 -0.254498 0.022585
C  4.23473 -2.963252 -0.542408
C  -3.157199 1.135616 -0.116971
C  -4.028203 -1.191285 0.075927
H  3.378054 -0.511596 -1.280642
H  1.906281 -1.358429 1.290705
H  1.527989 -1.842665 -0.377508
H  4.85173 0.886884 0.218627
H  3.708199 0.626088 1.564958
H  3.234189 2.193458 -1.051565
H  3.101813 2.785658 0.618482
H  0.470439 3.405411 -0.229115
H  4.463336 -1.783063 1.173304
H  -1.234041 -1.735945 0.218854
H  -2.404154 3.171942 -0.289247
H  3.294254 -3.528632 -0.335224
H  5.085625 -3.612949 -0.268749
H  4.286024 -2.793046 -1.634095
H  -4.215185 1.410399 -0.172641
H  -2.831925 -2.946071 0.219595
H  -4.570773 -3.178048 0.220488
