program: Gaussian 09
title: 000077954
version: EM64L-G09RevD.01
frameworkgroup: C1[X(C11H24O2)]
method: RPBEPBE
basis: SDD
operation: Freq
keyword: #pfreq=noraman
keyword: PBEPBE/SDD
title: #p freq=noraman PBEPBE/SDD
converged: YES YES NO NO
title: Mulliken charges:
elementType: O O C C C C C C C C C C C H H H H H H H H H H H H H H H H H H H H H H H H
charge: -0.434635 -0.450293 -0.450230 -0.366809 -0.058669 -0.379596 -0.374364 -0.435146 -0.352570 -0.351150 -0.356964 -0.342102 -0.696618 0.195079 0.200467 0.221980 0.192283 0.213640 0.188263 0.190599 0.190445 0.192690 0.198304 0.187081 0.186860 0.186780 0.212154 0.241629 0.195102 0.195682 0.183360 0.185620 0.316927 0.215370 0.209388 0.209286 0.340158
chargesum: 0.00000
title: Mulliken charges with hydrogens summed into heavy atoms:
elementType: O O C C C C C C C C C C C
charge: -0.117707 -0.110135 -0.054685 0.047454 0.154971 -0.000734 0.008771 -0.049761 0.021070 0.102632 0.033820 0.026878 -0.062574
polarizability: 1.68721649e+02 -1.17245837e+00 1.10121769e+02 -2.17257521e-01 -1.67340564e+00 1.06980949e+02
1716.lowfreq: -27.3985 -7.7661 -0.0006 0.0003 0.0009 7.6651 14.2225 27.1665 37.9501
frequency: 14.0323 26.9745 37.8888 52.3995 69.6250 85.3244 91.2097 103.5953 133.4039 144.7506 149.5142 166.6300 181.9302 228.8206 262.6832 271.1735 288.2245 301.0363 342.7216 400.6455 435.9785 451.8618 521.1875 550.7279 720.0772 728.7909 755.2709 766.5071 805.1795 832.3352 876.0403 887.2059 916.5389 965.2651 979.1730 988.0191 1006.1394 1009.0641 1027.2600 1047.5232 1065.5370 1071.6304 1074.2749 1082.7569 1085.2554 1113.7561 1125.9852 1158.6955 1186.4996 1203.7343 1218.6005 1225.8924 1246.0708 1251.0578 1267.6558 1273.5510 1279.3824 1281.2704 1288.2836 1292.2191 1303.9476 1321.7499 1327.6907 1348.1511 1353.9213 1357.0034 1360.4611 1365.2137 1386.7589 1416.3264 1447.1183 1459.3323 1460.2766 1461.5519 1467.6538 1472.5061 1475.5961 1476.3575 1483.1861 1487.8735 1488.0976 2919.8613 2939.7974 2945.4326 2947.6809 2950.3270 2957.0488 2966.5171 2966.6574 2969.3771 2971.2552 2984.0680 2992.8789 2996.4720 3000.8321 3002.9827 3012.9793 3029.0306 3033.9896 3046.8864 3068.2024 3070.1393 3073.3166 3532.6243 3564.2318
redmass: 3.3628 2.2747 3.0881 3.9103 2.0322 2.5321 3.0725 2.1495 2.4398 2.0470 2.2453 3.6021 4.6742 1.1128 3.2739 1.1094 1.2860 2.3534 3.5212 3.2207 2.6856 2.7216 2.8480 3.2202 1.0622 1.0955 1.1942 1.2731 1.5156 1.4513 1.3834 1.8902 1.3704 5.4550 4.4402 1.2832 3.4566 3.5226 1.5388 2.3379 2.8080 2.4647 1.2137 2.3065 2.3387 1.9547 2.6205 1.2491 1.7523 1.2632 1.3776 1.3843 1.3532 1.2896 1.2024 1.2512 1.0645 1.1325 1.1468 1.0968 1.2932 1.2543 1.3618 1.5001 1.6805 1.3986 1.5946 1.3365 1.2175 1.4394 1.0844 1.0769 1.0709 1.0721 1.0759 1.0814 1.0771 1.0436 1.0851 1.0904 1.0903 1.0544 1.0616 1.0612 1.0599 1.0588 1.0593 1.1062 1.0607 1.0607 1.0366 1.0961 1.0976 1.0948 1.0826 1.0724 1.1025 1.0957 1.0997 1.1025 1.1007 1.0993 1.1029 1.0656 1.0664
irintensity: 0.7585 0.8385 2.3317 0.4972 5.7485 0.0494 0.0418 0.4646 0.3985 0.2180 1.9948 0.5957 0.1188 0.0000 1.4460 144.6171 93.4342 107.7502 2.2678 11.2625 5.3868 2.2372 7.7058 16.8922 13.2209 0.0973 1.1178 1.8504 9.6755 7.7433 7.6014 5.0686 22.4833 54.7678 4.4116 14.2061 22.5742 8.3752 11.9590 5.2874 0.3158 8.7693 41.0260 2.8366 5.4415 3.4440 21.8711 4.6672 0.0464 14.3722 17.5453 11.7574 7.4081 11.3976 1.5413 6.2490 4.2159 1.0585 1.3849 0.5648 5.1762 2.6055 5.3187 5.1413 0.2841 6.6129 6.1637 15.8169 11.1398 7.8143 0.7433 2.3326 0.0717 1.2227 1.2708 3.9556 1.6092 12.1335 3.4534 10.0409 25.2048 64.1140 2.6168 25.5450 28.9990 4.6604 18.7900 58.9621 10.9818 162.9510 35.0197 3.3717 3.3868 2.2272 31.2565 14.8302 1.8201 44.1188 9.4969 153.0773 97.3725 55.3028 56.7347 3.6494 2.1435
temp: 298.150 k
press: 1.00000 atm
elementType: 8 8 6 6 6 6 6 6 6 6 6 6 6 1 1 1 1 1 1 1 1 1 1 1 1 1 1 1 1 1 1 1 1 1 1 1 1
symmnumber: 1
zpe: 873741.7 jmol-1
zpe.correction: 0.332791 hartree
zpe.thermalcorrener: 0.350709 hartree
zpe.thermalcorrenthalpy: 0.351653 hartree
zpe.thermalcorrgfe: 0.283938 hartree
zpe.sumelectzpe: -582.888459 hartree
zpe.sumelectthermal: -582.870541 hartree
zpe.sumelectthermalent: -582.869597 hartree
zpe.sumelectthermalfe: -582.937312 hartree
dipole: -0.2033 -3.2158 1.6567
dipole: 3.6232
quadrupole: -82.8984 -88.1879 -80.1417
quadrupole: -14.8794 8.3167 2.0561
quadrupole: 0.8443 -4.4453 3.6010 -14.8794 8.3167 2.0561
hfenergy: -583.2212499 hartree
pointgroup: C01 [X(C11H24O2)]
dipole: 0.0823431 1.3332749 0.4975206 debye
polarizability: 168.7203376|-1.1972511|110.4731862|0.2356286|1.2599102|106.6308422 unknown
InChI: InChI=1S/C11H24O2/c1-2-3-4-5-6-8-11(13)9-7-10-12/h11-13H,2-10H2,1H3
charge 0 multiplicity 1
37 atoms
O  -1.856654 -1.478182 0.76976
O  -6.791936 -0.111298 -0.314221
C  -0.498747 0.515733 0.142807
C  0.76826 -0.296051 -0.202987
C  -1.810686 -0.265948 -0.084713
C  2.077025 0.451839 0.135109
C  3.348084 -0.345792 -0.234655
C  -3.070735 0.603054 0.128099
C  4.65888 0.395767 0.111956
C  -4.377778 -0.135533 -0.232863
C  5.930718 -0.399769 -0.261441
C  -5.624365 0.686117 0.101914
C  7.235024 0.348702 0.089424
H  -0.455584 0.844055 1.204885
H  -0.523073 1.442173 -0.467403
H  0.735454 -1.261851 0.337974
H  0.756303 -0.544627 -1.28477
H  -1.820419 -0.689282 -1.107211
H  2.093195 1.429696 -0.391286
H  2.095768 0.684363 1.221001
H  3.333343 -0.57526 -1.320842
H  3.330886 -1.324378 0.288885
H  -2.975436 1.52353 -0.484175
H  -3.099138 0.934813 1.18983
H  4.676503 0.62221 1.198911
H  4.675671 1.376001 -0.409319
H  -4.390754 -0.370809 -1.314694
H  -4.420217 -1.09907 0.306582
H  5.91298 -0.625079 -1.347454
H  5.913318 -1.379217 0.258815
H  -5.60026 1.659319 -0.437824
H  -5.659156 0.895639 1.194532
H  -1.836373 -1.181053 1.716618
H  8.128691 -0.239344 -0.190003
H  7.292801 0.556352 1.174772
H  7.289269 1.318765 -0.440019
H  -7.622263 0.389915 -0.113796
