program: Gaussian 09
title: 000077980
version: EM64L-G09RevD.01
frameworkgroup: C1[X(C12H14N2O2)]
method: RPBEPBE
basis: SDD
operation: Freq
keyword: #p
keyword: freq=noraman
keyword: PBEPBE/SDD
title: #p freq=noraman PBEPBE/SDD
converged: YES YES NO NO
title: Mulliken charges:
elementType: O O N N C C C C C C C C C C C C H H H H H H H H H H H H H H
charge: -0.257781 -0.262161 -0.408346 -0.578489 0.413367 -0.596462 0.110236 -0.192501 0.232210 -0.435439 -0.406417 -0.351400 0.256474 -0.278826 -0.217768 -0.514446 0.229029 0.207745 0.253948 0.266003 0.303608 0.258550 0.225850 0.267410 0.293734 0.224549 0.221089 0.231383 0.244218 0.260633
chargesum: 0.00000
title: Mulliken charges with hydrogens summed into heavy atoms:
elementType: O O N N C C C C C C C C C C C C
charge: -0.257781 -0.262161 -0.104737 -0.017345 0.413367 -0.159689 0.110236 0.061447 0.232210 -0.169437 -0.147868 -0.125550 0.256474 -0.054277 0.003321 0.221788
polarizability: 1.69723478e+02 2.17799479e+01 1.56701832e+02 -1.74375920e+01 2.10613660e+01 1.09102232e+02
1716.lowfreq: -4.9690 -0.0007 -0.0006 -0.0006 4.5255 14.0747 31.3423 50.0133 63.6593
frequency: 31.1787 49.8812 63.6147 79.7626 105.4340 121.7535 182.7243 202.8831 217.1258 219.7050 263.3803 284.1845 289.8688 322.5766 386.5983 424.2510 444.9069 459.7073 505.4395 539.8099 569.9852 575.5447 593.0915 630.8518 642.4706 713.5233 741.9840 750.5224 752.1932 768.4774 793.7625 802.1967 853.0375 866.7592 906.2511 933.4989 947.8304 972.1984 975.7855 1013.3201 1057.9674 1093.4914 1101.9607 1117.4460 1127.5275 1141.8137 1147.3675 1155.7631 1170.6628 1194.9533 1240.3552 1254.7984 1285.8799 1297.4319 1309.3669 1350.3421 1388.1013 1390.6811 1421.6241 1424.3960 1453.3251 1459.4934 1463.3534 1468.0572 1481.6486 1558.7274 1585.4865 1603.2236 1630.8381 1649.4236 2980.0086 3003.7219 3033.0886 3052.8043 3109.7590 3123.2075 3131.9680 3145.3316 3149.9745 3161.8055 3216.4770 3460.5012 3596.2430 3612.6172
redmass: 4.5303 4.7487 7.0323 4.1917 1.0790 3.9092 4.4414 2.7279 3.7545 3.3374 1.3911 2.6667 3.8014 3.7854 5.6075 2.8883 3.9895 3.2583 1.2265 5.2513 1.8135 2.9601 3.0516 3.3509 3.3180 5.2834 3.8575 2.2114 2.0314 3.4896 2.3151 2.3747 1.4608 5.1618 4.7117 1.3798 2.1646 1.4279 4.0567 2.1607 3.3844 1.6449 2.1178 1.2946 1.4024 1.6742 1.6348 1.6288 1.1442 1.8153 2.5157 1.4527 1.4047 2.0794 1.2125 1.7882 1.5591 5.3490 2.3254 1.2931 1.0534 1.9384 1.5774 1.0510 3.0203 6.0598 6.1198 1.8029 6.8088 2.0977 1.0596 1.0293 1.0954 1.0938 1.1050 1.0848 1.0891 1.0954 1.1048 1.1002 1.0982 1.0445 1.0984 1.0809
irintensity: 0.1891 0.7366 2.9233 5.3559 0.0388 2.1846 5.0275 12.6119 14.0016 4.0349 58.0414 6.1972 1.3287 12.4829 1.3997 13.9148 1.1381 7.5227 85.0117 7.0049 198.7094 19.8143 138.7465 0.8546 9.0830 2.0942 9.0599 56.1458 66.7737 7.1568 11.5590 8.7577 1.6758 0.6416 7.5965 5.0192 2.9588 1.8689 9.0845 10.0709 7.6601 36.4759 34.5912 9.2657 5.2546 40.1197 35.1017 57.0939 8.1462 60.4722 17.7138 5.3616 1.1638 2.0826 2.5620 23.5190 11.4584 33.3862 2.0362 29.1344 9.5580 15.0611 18.7323 7.6016 2.3100 3.4295 0.3861 180.9372 2.6480 32.2746 44.1723 27.3063 7.3215 25.4365 18.1082 0.1854 8.2558 25.2543 14.1924 26.7873 1.5122 6.5082 5.9534 59.7625
temp: 298.150 k
press: 1.00000 atm
elementType: 8 8 7 7 6 6 6 6 6 6 6 6 6 6 6 6 1 1 1 1 1 1 1 1 1 1 1 1 1 1
symmnumber: 1
zpe: 632831.0 jmol-1
zpe.correction: 0.241033 hartree
zpe.thermalcorrener: 0.256256 hartree
zpe.thermalcorrenthalpy: 0.257200 hartree
zpe.thermalcorrgfe: 0.198087 hartree
zpe.sumelectzpe: -724.458226 hartree
zpe.sumelectthermal: -724.443003 hartree
zpe.sumelectthermalent: -724.442059 hartree
zpe.sumelectthermalfe: -724.501172 hartree
dipole: -2.1137 2.4640 1.7355
dipole: 3.6812
quadrupole: -92.9649 -79.9716 -92.6059
quadrupole: 3.5236 -8.7276 0.7751
quadrupole: -4.4507 8.5425 -4.0918 3.5236 -8.7276 0.7751
hfenergy: -724.6992588 hartree
pointgroup: C01[X(C12H14N2O2)]
dipole: 0.7271044 0.8590864 -0.9114858 debye
polarizability: 160.8524631|-27.8966984|154.0085731|-24.1790826|-20.3787294|120.6665059 unknown
InChI: InChI=1S/C12H14N2O2/c1-16-12(15)10(13)6-8-7-14-11-5-3-2-4-9(8)11/h2-5,7,10,14H,6,13H2,1H3
charge 0 multiplicity 1
30 atoms
O  -1.831894 -1.110914 -0.984578
O  -2.272244 -1.395422 1.285121
N  1.782431 1.750845 -1.405481
N  -3.677645 1.075683 1.053354
C  0.10442 1.417944 0.11806
C  -1.177364 1.58132 0.894026
C  1.08068 0.345842 0.252903
C  -2.444165 0.848682 0.286587
C  2.121755 0.581837 -0.714863
C  0.571545 2.249797 -0.900633
C  1.179251 -0.788466 1.103869
C  3.238561 -0.272758 -0.850945
C  -2.191927 -0.656627 0.272378
C  2.291731 -1.642945 0.974381
C  3.309892 -1.389187 0.006959
C  -1.443642 -2.542409 -1.072748
H  -1.057709 1.216433 1.932837
H  -1.450978 2.652812 0.957626
H  -2.575889 1.191578 -0.754061
H  0.132591 3.162871 -1.300135
H  2.331951 2.178853 -2.146836
H  0.402311 -0.999541 1.847223
H  4.024151 -0.080614 -1.590616
H  -3.921165 2.060573 1.186351
H  -3.725274 0.52112 1.914529
H  2.382475 -2.517493 1.628311
H  4.163352 -2.072445 -0.068305
H  -1.353854 -2.741847 -2.149473
H  -2.214982 -3.177576 -0.606659
H  -0.477867 -2.689245 -0.560782
