program: Gaussian 09
title: 000077956
version: EM64L-G09RevD.01
frameworkgroup: C1[X(C12H11NO2S)]
method: RPBEPBE
basis: SDD
operation: Freq
keyword: #p
keyword: freq=noraman
keyword: PBEPBE/SDD
title: #p freq=noraman PBEPBE/SDD
converged: YES YES NO NO
title: Mulliken charges:
elementType: S O O N C C C C C C C C C C C C H H H H H H H H H H H
charge: 0.851688 -0.560240 -0.530012 -0.695590 -0.218799 -0.019822 0.439342 -0.222676 -0.257283 -0.242399 -0.363620 -0.260028 -0.194286 -0.205507 -0.209113 -0.218357 0.277825 0.285016 0.268449 0.226056 0.237896 0.228471 0.240810 0.239520 0.236698 0.303661 0.362300
chargesum: 0.00000
title: Mulliken charges with hydrogens summed into heavy atoms:
elementType: S O O N C C C C C C C C C C C C
charge: 0.851688 -0.560240 -0.530012 -0.029629 -0.218799 -0.019822 0.439342 0.055149 0.027733 0.026050 -0.137564 -0.022132 0.034185 0.035303 0.030407 0.018342
polarizability: 1.90471365e+02 -8.11704713e-01 1.74513903e+02 -2.56204561e+00 -4.53640740e+00 1.20939901e+02
1716.lowfreq: -8.9495 -0.0011 -0.0008 0.0010 1.3325 7.3892 22.0473 41.9059 44.2311
frequency: 21.6830 41.8338 44.2183 135.9594 146.5916 182.7203 197.7543 241.8891 252.8756 254.1619 274.4201 357.1813 381.8495 401.6297 417.1514 446.9557 455.6676 480.0726 509.4316 536.7446 548.8531 602.9938 642.3523 658.7707 689.2506 705.2026 731.8876 757.4472 760.5449 770.7631 827.7085 846.1071 849.2862 903.6055 930.7275 951.6030 978.2364 978.9071 981.2517 986.6734 1004.2926 1008.8290 1029.9939 1048.7917 1064.5939 1077.4705 1149.1583 1172.7936 1173.3942 1177.8078 1273.7871 1302.2297 1331.7387 1383.7357 1387.3974 1435.4355 1447.3163 1453.5392 1485.5349 1562.3731 1578.0968 1604.4623 1612.9129 1639.0704 3124.2259 3136.5045 3141.6185 3147.3137 3148.4550 3157.1594 3166.9670 3174.2694 3175.8110 3347.5979 3636.9639
redmass: 3.8266 4.9979 5.7646 4.9257 6.8716 5.0213 7.4742 8.4160 5.5473 6.5154 7.4485 6.5193 8.5388 2.7945 3.9612 3.3545 1.2133 3.7859 5.0865 4.8687 4.5122 6.4275 6.8971 7.0064 2.0946 1.5951 1.9382 1.2819 2.1515 3.4976 5.2758 1.4023 1.2951 13.8955 1.3814 1.3550 2.5275 1.7919 1.5846 5.2250 1.3415 4.1605 1.9595 2.1223 1.6987 1.5452 1.2285 1.0618 1.0555 1.1200 1.6978 1.3045 1.8407 8.2720 5.5166 2.2546 2.6306 2.0420 3.2560 5.7846 5.8044 5.9702 1.9471 2.1305 1.0869 1.0856 1.0885 1.0889 1.0944 1.0929 1.0965 1.0995 1.1007 1.0608 1.0901
irintensity: 0.0567 0.3132 1.0908 0.7349 1.8340 1.2107 1.9061 7.7243 5.8357 0.6979 4.4233 2.2543 8.8206 0.2319 11.1493 19.9599 133.2030 35.7922 119.9024 10.8360 8.4975 0.4265 0.6019 11.2289 55.1030 92.2343 95.8729 80.1230 130.8753 9.8220 13.4758 2.3296 2.6497 76.4076 1.2831 1.6573 0.6027 2.2569 0.5140 5.0485 0.4346 1.3151 7.6250 20.8450 4.6814 5.5853 8.1110 8.7123 2.4206 4.3803 18.2116 5.1433 12.2270 3.0128 26.4706 14.1468 3.7756 16.1153 73.8409 12.1804 6.2078 0.7151 14.2961 256.8341 7.0277 0.7682 8.4038 15.1795 8.8266 2.7663 8.2435 22.2208 22.0763 159.1067 55.5871
temp: 298.150 k
press: 1.00000 atm
elementType: 16 8 8 7 6 6 6 6 6 6 6 6 6 6 6 6 1 1 1 1 1 1 1 1 1 1 1
symmnumber: 1
zpe: 530212.5 jmol-1
zpe.correction: 0.201947 hartree
zpe.thermalcorrener: 0.216298 hartree
zpe.thermalcorrenthalpy: 0.217242 hartree
zpe.thermalcorrgfe: 0.159526 hartree
zpe.sumelectzpe: -1065.842974 hartree
zpe.sumelectthermal: -1065.828623 hartree
zpe.sumelectthermalent: -1065.827679 hartree
zpe.sumelectthermalfe: -1065.885396 hartree
dipole: -0.1295 1.2024 -5.9174
dipole: 6.0397
quadrupole: -83.3368 -88.3657 -114.5046
quadrupole: 4.4348 1.5720 -1.3507
quadrupole: 12.0656 7.0367 -19.1022 4.4348 1.5720 -1.3507
hfenergy: -1066.0449215 hartree
pointgroup: C01[X(C12H11N1O2S1)]
dipole: 0.0724938 -0.1420499 -2.3708601 debye
polarizability: 190.4911267|-0.6953961|172.1644053|2.5569508|11.823882|123.2696371 unknown
InChI: InChI=1S/C12H11NO2S/c13-11-8-4-5-9-12(11)16(14,15)10-6-2-1-3-7-10/h1-9H,13H2
charge 0 multiplicity 1
27 atoms
S  0.105143 -0.185113 1.440242
O  0.099474 -1.762749 1.934967
O  0.17537 1.046309 2.513757
N  -1.565619 -2.308754 -0.239424
C  -1.407923 0.089105 0.34249
C  1.611932 0.019797 0.29942
C  -2.007994 -1.000954 -0.357466
C  -1.88936 1.408636 0.293796
C  2.234185 1.277689 0.274883
C  2.06516 -1.09484 -0.423369
C  -3.114156 -0.657324 -1.200295
C  -2.989667 1.709312 -0.534114
C  -3.583083 0.664252 -1.288074
C  3.371191 1.429964 -0.552523
C  3.202752 -0.922025 -1.246451
C  3.848048 0.335703 -1.312868
H  -1.406529 2.175514 0.910032
H  1.855289 2.092597 0.900648
H  1.56343 -2.063025 -0.333456
H  -3.607532 -1.455649 -1.767701
H  -3.376536 2.730658 -0.589749
H  -4.436487 0.882847 -1.939957
H  3.88464 2.396106 -0.59586
H  3.585526 -1.768427 -1.826187
H  4.730843 0.460267 -1.949403
H  -2.062205 -3.046908 -0.732196
H  -0.947091 -2.54179 0.551457
