program: Gaussian 09
title: 000077917
version: EM64L-G09RevD.01
frameworkgroup: C1[X(C16H12N2)]
method: RPBEPBE
basis: SDD
operation: Freq
keyword: #pfreq=noraman
keyword: PBEPBE/SDD
title: #p freq=noraman PBEPBE/SDD
converged: NO YES NO YES
title: Mulliken charges:
elementType: N N C C C C C C C C C C C C C C C C H H H H H H H H H H H H
charge: -0.483829 0.001698 0.009031 0.218423 0.180298 0.241930 0.223292 0.321000 -0.676269 0.366774 -0.384821 -0.823463 -0.378470 -0.325829 -0.547647 -0.254369 -0.210831 -0.373307 0.302842 0.243927 0.235878 0.245600 0.245583 0.206364 0.234454 0.236743 0.257071 0.225923 0.225384 0.236621
chargesum: 0.00000
title: Mulliken charges with hydrogens summed into heavy atoms:
elementType: N N C C C C C C C C C C C C C C C C
charge: -0.180988 0.001698 0.009031 0.218423 0.180298 0.241930 0.223292 0.321000 -0.432342 0.366774 -0.148943 -0.125916 -0.144016 -0.089086 -0.290576 -0.028446 0.014553 -0.136686
polarizability: 3.52293671e+02 -9.15130622e-01 1.93641308e+02 -1.30898877e-03 6.60120820e-03 7.55359097e+01
1716.lowfreq: -0.0009 -0.0007 0.0006 3.4293 5.9492 12.0529 50.1788 73.2852 96.9845
frequency: 49.6081 73.2691 96.9840 137.8356 152.0476 177.5928 242.1932 267.4750 313.9417 315.9950 352.3810 364.0282 417.3387 461.4389 475.2702 487.7586 526.0591 526.4031 570.6707 578.8946 589.7674 592.6181 622.7879 673.5702 728.5162 745.5476 754.8466 771.8987 801.5058 804.3929 830.3206 855.1611 858.5515 879.3441 888.0476 922.6303 938.6923 943.0370 963.3047 976.1406 1016.2437 1021.9212 1032.0578 1059.4329 1084.7374 1108.7950 1162.5917 1177.2744 1212.3746 1217.8273 1247.9540 1248.2333 1281.2248 1316.8407 1333.4001 1359.0030 1369.1370 1402.0916 1404.6573 1420.2127 1426.7994 1449.8473 1465.8156 1467.4242 1474.4432 1480.4704 1484.7643 1576.6882 1592.7909 1601.3508 1627.7567 1648.4241 2974.9090 3049.9596 3076.4106 3100.5506 3128.0551 3132.4506 3134.4435 3136.1876 3148.4588 3158.7374 3166.2233 3616.9890
redmass: 1.2520 3.1376 3.6644 3.0664 5.1118 5.5777 3.7920 3.0885 4.0899 5.8069 5.4118 5.2976 3.0086 2.8047 5.7622 1.2447 5.4207 2.9539 3.9755 4.8479 4.0031 7.0505 6.2852 6.3679 3.7353 5.0227 1.5412 3.2523 2.6654 5.2882 1.5251 4.9158 1.4524 3.6483 1.4435 4.0891 1.4060 1.6518 1.4359 1.3152 2.1263 2.7883 1.5130 2.6821 2.3629 1.8517 1.5002 1.5374 1.6876 1.5982 2.4925 1.4573 3.0738 2.9189 2.0547 2.4871 2.3058 1.3005 3.1956 3.8246 3.0797 3.4493 1.0444 3.8272 2.1468 2.1602 1.7313 7.0677 6.3858 7.2898 6.9156 7.8948 1.0376 1.0980 1.0972 1.0908 1.0853 1.0869 1.0911 1.0904 1.0952 1.0974 1.1002 1.0796
irintensity: 0.9504 0.0269 0.6105 0.5029 0.0245 0.8034 0.0021 0.1669 0.1494 0.1667 5.4652 0.3874 2.2457 0.3040 2.6920 111.6102 0.4416 2.2840 0.2818 3.1833 2.4581 7.4930 3.1386 1.3257 19.8459 7.6232 78.3257 5.7730 3.2409 1.9902 41.2676 6.2678 0.4165 6.8753 16.0639 2.1264 7.6997 11.0574 1.3196 0.0203 6.9608 6.7642 2.4542 2.4177 1.6030 8.1996 10.8017 4.1717 2.4247 0.6243 108.5467 17.3776 9.1011 10.1584 64.8494 36.3456 15.6802 13.8137 7.9925 3.8534 20.7300 42.4958 13.1081 96.8748 9.8011 2.4824 56.6216 11.2567 9.0257 2.1567 97.7564 22.8992 36.4007 15.9977 24.8329 18.8252 1.0400 5.7531 8.1036 0.9557 28.0556 43.6473 34.7202 43.1114
temp: 298.150 k
press: 1.00000 atm
elementType: 7 7 6 6 6 6 6 6 6 6 6 6 6 6 6 6 6 6 1 1 1 1 1 1 1 1 1 1 1 1
symmnumber: 1
zpe: 618013.7 jmol-1
zpe.correction: 0.235389 hartree
zpe.thermalcorrener: 0.248812 hartree
zpe.thermalcorrenthalpy: 0.249756 hartree
zpe.thermalcorrgfe: 0.195341 hartree
zpe.sumelectzpe: -725.230668 hartree
zpe.sumelectthermal: -725.217246 hartree
zpe.sumelectthermalent: -725.216301 hartree
zpe.sumelectthermalfe: -725.270717 hartree
dipole: -3.5036 3.8165 0.0003
dipole: 5.1808
quadrupole: -109.0193 -88.3689 -111.2005
quadrupole: 9.6067 0.0002 0.0016
quadrupole: -6.1564 14.4940 -8.3376 9.6067 0.0002 0.0016
hfenergy: -725.4660573 hartree
pointgroup: C01[X(C16H12N2)]
dipole: 1.3985218 -1.4827998 0.0001325 debye
polarizability: 352.2895152|1.2234626|193.6454639|0.0013978|-0.006583|75.5359097 unknown
InChI: InChI=1S/C16H12N2/c1-10-12-6-7-17-9-11(12)8-14-13-4-2-3-5-15(13)18-16(10)14/h2-9,18H,1H3
charge 0 multiplicity 1
30 atoms
N  1.43762 -1.643887 0.000132
N  -4.278859 1.475671 -0.000026
C  0.213782 -0.950355 0.000052
C  0.516488 0.474292 0.000008
C  1.973088 0.601266 0.000006
C  -1.091422 -1.462827 0.00004
C  2.509531 -0.730649 0.000108
C  -2.158439 -0.498258 0.000026
C  -0.524013 1.403049 -0.00004
C  -1.871923 0.931495 -0.000016
C  2.854058 1.705396 -0.000064
C  -1.378361 -2.952632 0.00008
C  3.896951 -0.977367 0.000153
C  -3.546648 -0.869381 0.000065
C  -2.983309 1.84238 -0.000047
C  4.246714 1.469923 -0.000024
C  4.758672 0.143198 0.000082
C  -4.538465 0.11268 0.00003
H  1.537843 -2.655596 0.000235
H  -0.328601 2.481474 -0.000086
H  2.466487 2.73026 -0.000134
H  -1.962899 -3.252399 0.890389
H  -1.963859 -3.252239 -0.889645
H  -0.455487 -3.557921 -0.000491
H  4.30067 -1.995649 0.000227
H  -3.838912 -1.924111 0.000126
H  -2.785679 2.922967 -0.000094
H  4.942643 2.315474 -0.00007
H  5.843042 -0.014276 0.000114
H  -5.599412 -0.160579 0.000065
