program: Gaussian 09
title: 000077947
version: EM64L-G09RevD.01
frameworkgroup: C1[X(C11H24O4)]
method: RPBEPBE
basis: SDD
operation: Freq
keyword: #pfreq=noraman
keyword: PBEPBE/SDD
title: #p freq=noraman PBEPBE/SDD
converged: YES YES NO NO
title: Mulliken charges:
elementType: O O O O C C C C C C C C C C C H H H H H H H H H H H H H H H H H H H H H H H H
charge: -0.209238 -0.207064 -0.201330 -0.204173 0.336340 0.339215 0.370347 -0.696341 -0.714515 -0.697345 -0.699266 -0.711279 -0.692977 -0.709605 -0.711659 0.243262 0.196219 0.221678 0.229569 0.230403 0.207467 0.213936 0.191912 0.268639 0.216342 0.206334 0.238337 0.232995 0.229183 0.208749 0.241846 0.198823 0.226079 0.215273 0.229539 0.257835 0.227016 0.220835 0.256619
chargesum: 0.00000
title: Mulliken charges with hydrogens summed into heavy atoms:
elementType: O O O O C C C C C C C C C C C
charge: -0.209238 -0.207064 -0.201330 -0.204173 0.336340 0.339215 0.370347 -0.035182 -0.047076 -0.022857 -0.038253 -0.040352 -0.026229 -0.006958 -0.007190
polarizability: 1.67924050e+02 8.80941735e-01 1.45850678e+02 5.34200488e+00 -5.87481275e-01 1.23943067e+02
1716.lowfreq: -0.0011 -0.0006 -0.0005 3.3577 8.4722 13.4760 34.3988 37.4873 47.3355
frequency: 34.1337 37.3519 47.2616 83.3161 94.5403 103.3890 144.6972 151.6880 159.5461 160.0540 189.1135 211.2344 219.1786 224.3366 225.4635 232.3205 239.5713 240.3268 261.2786 288.4803 325.4546 330.6343 338.5790 356.8720 381.8838 415.6014 416.8804 441.2974 442.9306 484.1724 497.9507 532.0233 551.3978 726.8615 731.6612 771.3226 773.6487 810.0290 813.6310 833.0441 837.4248 898.3816 910.4083 911.9086 918.4407 920.6820 936.5840 950.4279 950.9324 1002.4686 1020.8798 1023.1436 1024.8475 1027.3874 1141.4097 1178.8575 1188.4456 1190.6495 1239.5942 1250.7581 1252.6120 1263.2110 1273.7685 1366.3352 1369.0829 1370.4053 1372.9340 1374.9400 1387.8241 1392.2731 1397.6203 1442.8147 1443.2387 1448.1131 1458.6574 1460.8654 1462.2069 1464.9206 1466.2613 1466.9557 1469.0350 1469.7243 1471.4893 1473.6702 1478.3602 1497.1880 1499.2337 2984.8202 2986.4926 2987.6307 2988.9729 2992.1543 2993.4394 3011.8772 3014.1086 3079.4129 3081.8110 3084.7868 3086.6628 3093.5685 3094.4367 3095.7184 3095.8971 3100.0334 3103.8422 3105.6942 3107.7982 3112.4048 3117.8454 3128.5715 3130.1556
redmass: 3.2429 2.9437 3.2687 3.6993 3.2750 3.6233 1.6204 1.1122 1.3565 1.0951 1.3759 1.7153 1.1602 1.4754 1.5543 1.2921 2.3848 1.0776 2.7001 2.6964 2.5888 2.6087 2.9352 2.6321 2.4708 2.5379 2.5384 2.9917 3.0464 3.2537 2.9313 4.0458 5.0088 5.1134 4.6166 5.1354 4.5759 4.5737 5.8112 5.0630 5.0151 2.5548 1.6129 1.6062 1.5757 1.5603 1.3951 1.2058 1.2066 1.3266 1.4121 1.4270 1.4312 1.4534 1.9528 2.2203 2.1540 2.1207 3.9914 3.0270 3.0604 3.2724 3.7040 1.2275 1.2276 1.2273 1.2276 1.2291 1.2086 1.2089 1.2089 1.0475 1.0486 1.0519 1.0467 1.0516 1.0525 1.0540 1.0513 1.0496 1.0597 1.0616 1.0521 1.0517 1.0474 1.0549 1.0536 1.0359 1.0350 1.0349 1.0348 1.0356 1.0356 1.0348 1.0349 1.0996 1.0998 1.0996 1.0995 1.0992 1.0993 1.1003 1.1004 1.0996 1.0998 1.0996 1.0990 1.1011 1.1004 1.0999 1.1000
irintensity: 0.5243 0.3006 0.1728 3.4142 3.1740 1.3663 1.5674 0.0245 1.2747 0.3201 0.5638 0.4523 0.0767 0.8280 0.1640 0.1507 0.5435 1.4996 0.1802 0.7468 1.0358 3.0848 5.4776 0.0369 0.3067 0.5426 0.2000 4.1182 1.6189 0.3337 4.6564 8.6187 5.1524 10.7664 45.6844 7.1064 82.3395 7.0179 2.7450 3.8458 3.4180 6.9507 0.4479 0.7384 1.3654 1.0429 0.2927 0.1827 0.1612 1.5698 0.1328 1.7003 3.1903 1.4074 298.1145 125.4079 41.6185 25.1910 33.7615 26.6381 30.6842 7.7085 9.3853 34.0627 27.8637 34.4981 39.4944 39.5167 29.0402 14.5355 7.9839 0.9133 0.6745 12.3679 1.0463 1.5612 1.0664 2.9020 3.3627 4.2638 14.7518 3.6080 7.2075 3.5841 16.6100 31.1429 19.9522 17.3165 23.0027 18.3729 18.1939 35.9643 20.6552 6.2559 20.4982 14.4865 12.7632 15.0805 12.9261 53.2841 55.5593 23.7347 18.6131 32.5159 24.0465 26.7080 18.6234 2.1409 37.8494 6.6599 16.9139
temp: 298.150 k
press: 1.00000 atm
elementType: 8 8 8 8 6 6 6 6 6 6 6 6 6 6 6 1 1 1 1 1 1 1 1 1 1 1 1 1 1 1 1 1 1 1 1 1 1 1 1
symmnumber: 1
zpe: 877572.5 jmol-1
zpe.correction: 0.334250 hartree
zpe.thermalcorrener: 0.354891 hartree
zpe.thermalcorrenthalpy: 0.355835 hartree
zpe.thermalcorrgfe: 0.286346 hartree
zpe.sumelectzpe: -733.061857 hartree
zpe.sumelectthermal: -733.041216 hartree
zpe.sumelectthermalent: -733.040272 hartree
zpe.sumelectthermalfe: -733.109760 hartree
dipole: 1.7114 -0.5025 -0.2600
dipole: 1.8025
quadrupole: -85.7878 -87.5479 -94.2532
quadrupole: 2.4074 0.7360 -0.2808
quadrupole: 3.4085 1.6484 -5.0569 2.4074 0.7360 -0.2808
hfenergy: -733.3961065 hartree
pointgroup: C01 [X(C11H24O4)]
dipole: -0.6676005 0.2370297 -0.0319773 debye
polarizability: 167.311888|1.0600275|145.0341879|-7.4224078|4.0880357|125.3717195 unknown
InChI: InChI=1S/C11H24O4/c1-9(2,3)12-14-11(7,8)15-13-10(4,5)6/h1-8H3
charge 0 multiplicity 1
39 atoms
O  2.262724 -0.592055 -0.591472
O  -1.323763 0.193908 0.618916
O  1.292478 -1.213373 0.437073
O  -0.763614 -0.482001 -0.660906
C  2.812315 0.677499 -0.003916
C  -2.612911 0.854187 0.230531
C  0.062729 -1.628205 -0.253135
C  3.502927 0.374916 1.341096
C  3.835716 1.059744 -1.097186
C  1.698331 1.73028 0.136628
C  -3.645059 -0.20491 -0.20658
C  -3.003351 1.515976 1.570783
C  -2.358423 1.904189 -0.870058
C  0.337003 -2.325775 -1.596782
C  -0.615375 -2.525635 0.796998
H  2.762312 0.040093 2.086063
H  4.004611 1.282334 1.724699
H  4.257844 -0.421263 1.217068
H  3.335031 1.193466 -2.072008
H  4.611336 0.281355 -1.201314
H  4.324364 2.011596 -0.821833
H  1.25488 1.957058 -0.848874
H  2.10737 2.662939 0.568285
H  0.892997 1.354046 0.788466
H  -3.815735 -0.937414 0.602388
H  -4.609614 0.275738 -0.452456
H  -3.284642 -0.741954 -1.10008
H  -2.236096 2.244227 1.885376
H  -3.117694 0.7584 2.365574
H  -3.964755 2.046682 1.450483
H  -2.006039 1.417806 -1.794655
H  -3.289321 2.457051 -1.093386
H  -1.588687 2.624095 -0.541351
H  -0.587873 -2.790396 -1.976663
H  1.103747 -3.103172 -1.444471
H  0.716394 -1.601667 -2.333565
H  -0.042743 -3.460519 0.91042
H  -1.639325 -2.761522 0.462131
H  -0.670689 -2.011425 1.768312
