program: Gaussian 09
title: 000077883
version: EM64L-G09RevD.01
frameworkgroup: C1[X(C11H13N)]
method: RPBEPBE
basis: SDD
operation: Freq
keyword: #pfreq=noraman
keyword: PBEPBE/SDD
title: #p freq=noraman PBEPBE/SDD
converged: YES YES NO YES
title: Mulliken charges:
elementType: N C C C C C C C C C C C H H H H H H H H H H H H H
charge: -0.025046 0.134036 0.497408 -0.694116 -0.694109 -0.744417 -0.378421 -0.399937 -0.406523 -0.389387 0.396369 -0.260074 0.212959 0.215841 0.225196 0.215849 0.212959 0.225195 0.221095 0.217783 0.217772 0.235921 0.255985 0.254001 0.253662
chargesum: 0.00000
title: Mulliken charges with hydrogens summed into heavy atoms:
elementType: N C C C C C C C C C C C
charge: -0.025046 0.134036 0.497408 -0.040120 -0.040106 -0.087767 -0.142500 -0.143952 -0.152522 -0.135725 0.396369 -0.260074
polarizability: 1.88215725e+02 -4.87899036e-01 1.10992340e+02 -2.49802369e-03 1.59743293e-05 7.36906237e+01
1716.lowfreq: -17.9513 -7.4345 -2.4070 -0.0007 0.0004 0.0008 42.2298 69.8701 126.7211
frequency: 42.1572 69.8524 126.7211 168.6680 203.2154 224.0114 246.3942 284.3347 313.6522 317.6554 320.4120 375.2471 401.0071 445.9437 463.0402 500.4742 548.8478 577.5647 610.7662 643.1903 750.2458 769.8206 834.9621 849.9238 854.2036 919.9250 930.7608 941.3335 972.4059 982.0105 1008.9154 1019.0918 1024.1806 1106.7278 1124.3355 1193.4211 1204.5830 1214.5328 1216.8662 1272.3205 1311.0302 1353.0912 1376.3426 1376.5167 1405.5657 1411.1799 1459.0053 1464.1406 1467.3974 1478.7120 1486.8764 1495.2866 1501.9285 1559.2096 1616.3536 2175.3951 2974.5726 2974.9714 2980.1673 3071.0376 3071.2392 3071.8583 3079.2785 3080.5244 3081.9364 3133.8615 3148.2948 3160.7974 3172.3069
redmass: 3.2190 4.8928 6.7008 2.3446 1.3097 2.2196 1.2747 3.6008 2.8193 1.0999 2.5487 2.5853 2.8177 3.0119 3.2927 5.2133 6.9529 2.6551 4.0422 7.4570 3.6006 5.5344 2.7428 1.3005 1.5734 1.7270 1.6512 1.2030 1.3637 1.3807 2.6097 1.5507 1.3873 2.6273 1.4621 1.5746 3.0088 1.9371 2.3779 3.1263 1.2918 4.8977 1.2484 1.1828 1.2008 3.3509 1.0506 1.0482 1.0783 1.0783 1.0506 1.3159 1.5736 6.6645 6.1716 12.6309 1.0350 1.0347 1.0360 1.1005 1.1006 1.1000 1.0998 1.0984 1.0996 1.0878 1.0887 1.0964 1.0958
irintensity: 0.0120 1.1196 3.0437 1.8807 0.1916 0.5387 0.0174 0.1272 0.1783 0.1249 0.1619 0.3272 0.0077 0.2583 0.0903 0.8129 0.2639 25.5959 0.5991 0.0084 0.7735 2.3970 5.4405 8.4174 52.3895 4.6429 2.4126 0.1621 0.9999 0.0009 5.7235 6.0785 0.2790 21.1299 8.4038 0.8581 5.6046 1.5137 1.9362 31.8239 0.0962 0.1828 22.4645 18.4776 7.6580 10.3830 0.0684 0.7378 0.4132 17.4530 12.9790 0.5214 45.2604 0.5752 29.9484 51.5011 31.0706 31.1648 23.9755 0.0056 14.9796 7.3210 38.1355 114.5989 41.4355 11.5632 3.7686 12.3918 5.7339
temp: 298.150 k
press: 1.00000 atm
elementType: 7 6 6 6 6 6 6 6 6 6 6 6 1 1 1 1 1 1 1 1 1 1 1 1 1
symmnumber: 1
zpe: 544376.2 jmol-1
zpe.correction: 0.207342 hartree
zpe.thermalcorrener: 0.219294 hartree
zpe.thermalcorrenthalpy: 0.220238 hartree
zpe.thermalcorrgfe: 0.169672 hartree
zpe.sumelectzpe: -480.835528 hartree
zpe.sumelectthermal: -480.823576 hartree
zpe.sumelectthermalent: -480.822632 hartree
zpe.sumelectthermalfe: -480.873198 hartree
dipole: 5.6424 0.0255 -0.0003
dipole: 5.6425
quadrupole: -96.1462 -65.2272 -74.7277
quadrupole: -0.1490 0.0017 0.0000
quadrupole: -17.4459 13.4732 3.9727 -0.1490 0.0017 0.0000
hfenergy: -481.0428701 hartree
pointgroup: C01 [X(C11H13N1)]
dipole: -2.2198657 0.0167217 0.0000668 debye
dipolederiv: -0.5579671 0.0015891 -0.0001227 0.0041557 -0.230844 -0.0000042 -0.0000109 -0.000005 -0.251978 0.1545961 -0.0449549 -0.0000026 -0.1652652 0.1153369 -0.0000011 -0.0000322 0.0000024 0.1235314 0.4840518 0.0454711 0.0000312 0.0583829 -0.0297358 -0.0000087 0.0000468 -0.0000077 -0.0841776 -0.0716853 -0.0108278 0.0272103 0.0414039 0.0119007 0.0436003 -0.0611728 0.0387732 -0.0109766 -0.071712 -0.0108348 -0.0272131 0.0414347 0.0118847 -0.0436007 0.0611885 -0.0387734 -0.0109499 -0.0386354 0.0492221 -0.0000094 0.0283757 -0.0545531 0.0000117 -0.0000108 0.0000138 0.0419144 -0.2672062 0.1173971 -0.0000355 0.2191492 0.0343115 -0.0000392 -0.0000496 -0.0000388 -0.1341607 -0.2882188 -0.1149573 0.0000224 -0.1972393 0.0288818 -0.0000428 0.0000446 -0.0000553 -0.1286189 0.1130422 -0.0575042 0.0000304 0.0829647 0.0698696 -0.0000577 -0.0000525 -0.0000548 -0.1455724 0.1052879 0.0708141 -0.0000042 -0.0751569 0.0680331 -0.0000499 -0.0000146 -0.0000503 -0.1304016 -0.2123566 0.001712 0.0000035 0.010015 0.0981997 0.0000026 -0.0000106 0.0000022 0.105296 0.5956077 -0.0047655 0.0001071 -0.0110443 -0.062014 0.0000205 0.0000818 0.0000201 0.0209583 -0.2322794 -0.027313 0.0325664 -0.0156378 0.0942766 0.0143674 0.0188444 0.0110543 0.0730547 0.0888331 0.1018233 -0.0054675 0.0832453 -0.1343551 0.0383325 -0.0067408 -0.0124635 0.0683375 0.0944067 -0.0400806 -0.0702006 -0.0265869 0.0276703 -0.1118083 -0.0462625 -0.0620828 -0.0994388 0.0888251 0.1018107 0.0054347 0.0832377 -0.1343614 -0.0382801 0.0067195 0.0125271 0.0683459 -0.2322782 -0.0273103 -0.0325873 -0.0156425 0.0942694 -0.014377 -0.0188861 -0.0110682 0.0730528 0.0943943 -0.0400733 0.0702315 -0.0265879 0.027717 0.1117734 0.0462949 0.062042 -0.0994684 -0.2093727 0.0211203 -0.000031 -0.0519848 0.0897574 -0.0000045 -0.0000221 0.0000022 0.0973934 0.0945523 -0.0552206 -0.0719999 -0.0228504 -0.0080134 -0.0908462 -0.0598558 -0.1112778 -0.0792437 0.0945384 -0.055244 0.0720499 -0.0228667 -0.0079854 0.0908335 0.0599025 0.1112498 -0.07925 0.028998 -0.098668 0.0000212 -0.1122201 -0.0335597 0.0000413 0.0000252 0.0000402 0.13252 0.074777 0.0770528 -0.0000224 0.0934485 -0.0362074 0.0000446 -0.0000177 0.0000569 0.1309015 0.0372877 0.0742886 -0.0000253 0.0682921 -0.0216908 0.0000489 -0.0000223 0.0000525 0.1598435 0.0325136 -0.0745469 0.000013 -0.0710226 -0.0187886 0.0000438 0.0000131 0.0000406 0.1590872 unknown
polarizability: 188.2179603|0.2557456|110.9901024|-0.0004427|-0.0095544|73.6906261 unknown
InChI: InChI=1S/C11H13N/c1-11(2,3)10-6-4-9(8-12)5-7-10/h4-7H,1-3H3
charge 0 multiplicity 1
25 atoms
N  4.631795 -0.030372 -0.000109
C  -2.417773 0.009944 -0.000071
C  -0.871545 0.032955 -0.000013
C  -2.919338 -0.73875 1.272319
C  -2.919234 -0.739047 -1.272331
C  -3.030607 1.433781 -0.000254
C  -0.144534 -1.191569 0.000332
C  -0.121208 1.238058 -0.00029
C  1.260556 -1.218383 0.00039
C  1.288493 1.230637 -0.000238
C  1.995932 -0.000199 0.000103
C  3.435239 -0.016412 0.000182
H  -4.024639 -0.775594 1.27903
H  -2.546832 -1.777808 1.311447
H  -2.584803 -0.223617 2.19112
H  -2.546756 -1.778127 -1.311162
H  -4.024535 -0.775858 -1.279153
H  -2.584584 -0.224153 -2.191225
H  -4.13303 1.358395 -0.000366
H  -2.7362 2.009027 0.896994
H  -2.736004 2.008883 -0.897531
H  -0.683981 -2.145125 0.000564
H  -0.636706 2.202219 -0.000558
H  1.797424 -2.172371 0.000668
H  1.84597 2.172885 -0.00045
