program: Gaussian 09
title: 000077819
version: EM64L-G09RevD.01
frameworkgroup: C1[X(C7H5Cl3S)]
method: RPBEPBE
basis: SDD
operation: Freq
keyword: #p
keyword: freq=noraman
keyword: PBEPBE/SDD
title: #p freq=noraman PBEPBE/SDD
converged: YES YES NO NO
title: Mulliken charges:
elementType: Cl Cl Cl S C C C C C C C H H H H H
charge: -0.015289 -0.004631 0.000970 0.274361 -0.175156 -0.102338 -0.071790 -0.123451 -0.190257 -0.088637 -0.872845 0.271588 0.285561 0.270280 0.271025 0.270610
chargesum: 0.00000
title: Mulliken charges with hydrogens summed into heavy atoms:
elementType: Cl Cl Cl S C C C C C C C
charge: -0.015289 -0.004631 0.000970 0.274361 -0.175156 -0.102338 0.199798 -0.123451 0.095304 -0.088637 -0.060931
polarizability: 1.81999918e+02 3.15758684e+00 1.39997178e+02 -3.48321582e-02 1.55207464e-02 4.76166103e+01
1716.lowfreq: -2.5195 -0.8534 0.0024 0.0027 0.0036 7.6971 49.9401 75.0370 122.6935
frequency: 49.9217 75.0353 122.6923 143.5446 177.8226 185.9961 198.7086 253.7119 255.9486 308.4566 330.6582 334.2582 437.3107 459.1169 487.5411 586.4055 593.1350 660.3507 675.2413 678.0219 803.0082 842.8411 864.3550 967.7558 992.3817 1008.7671 1105.8080 1140.6051 1240.5022 1303.6019 1353.2741 1364.4023 1425.6771 1458.5525 1463.2077 1542.9132 1570.7161 3007.9487 3127.4654 3135.0360 3179.2285 3181.5115
redmass: 4.7057 10.2720 9.1257 5.7097 17.8020 23.0747 2.8037 1.3351 5.4474 17.5510 10.7348 13.8636 3.0416 12.7105 5.9687 11.7945 9.0678 7.1817 7.7649 3.6624 11.8522 1.4741 1.3869 1.1816 1.3295 7.0663 1.6611 7.2562 1.2054 8.0948 1.1591 8.5942 2.5687 1.0514 1.0762 8.9571 8.3203 1.0293 1.1065 1.1019 1.0908 1.0929
irintensity: 1.6586 0.7576 0.1495 1.0046 0.9486 0.8230 0.0000 0.2387 1.2230 0.4083 0.0060 0.1354 14.9658 7.7816 2.3968 0.0243 63.3202 1.5159 0.3599 0.0092 0.7649 4.1360 32.3081 7.9708 3.6412 116.5433 50.7412 3.6761 2.2586 37.6014 3.4751 11.9329 189.4806 17.2369 19.2055 2.5800 3.7530 18.3058 15.0620 5.1808 0.1953 0.9386
temp: 298.150 k
press: 1.00000 atm
elementType: 17 17 17 16 6 6 6 6 6 6 6 1 1 1 1 1
symmnumber: 1
zpe: 257756.0 jmol-1
zpe.correction: 0.098174 hartree
zpe.thermalcorrener: 0.109752 hartree
zpe.thermalcorrenthalpy: 0.110696 hartree
zpe.thermalcorrgfe: 0.059057 hartree
zpe.sumelectzpe: -2047.172560 hartree
zpe.sumelectthermal: -2047.160983 hartree
zpe.sumelectthermalent: -2047.160038 hartree
zpe.sumelectthermalfe: -2047.211677 hartree
dipole: 1.5848 2.2007 0.0144
dipole: 2.7120
quadrupole: -96.3643 -82.8985 -94.5427
quadrupole: 9.5902 0.0461 0.0287
quadrupole: -5.0958 8.3700 -3.2742 9.5902 0.0461 0.0287
hfenergy: -2047.2707343 hartree
pointgroup: C01 [X(C7H5Cl3S1)]
dipole: -0.7516156 0.7420819 0.1510597 debye
dipolederiv: -0.3138864 -0.2561713 -0.0163356 -0.3045024 -0.5535522 -0.0514639 -0.0229568 -0.0553055 -0.0399915 -0.3293372 -0.2810507 -0.0185523 -0.3758442 -0.4885132 -0.0389032 -0.0319748 -0.0453729 -0.031371 -0.7634852 0.1186288 0.0696092 0.1413939 -0.0880936 -0.0193862 0.0730203 -0.0177492 -0.0299432 -0.535054 0.2335468 0.066479 0.097001 0.1301588 0.0154206 0.0503623 0.0066172 -0.0442289 0.921095 -0.4137037 -0.1275237 -0.2663201 -0.2715217 -0.0084052 -0.1069986 0.0013286 -0.0586912 0.1338596 0.5335489 0.0611614 0.6087111 0.753446 0.071109 0.0700799 0.0772662 -0.0538398 -0.4416084 0.0301803 0.0301181 -0.1617466 -0.1465115 -0.0000084 0.0047803 -0.0137478 -0.0670303 0.3275038 0.4812708 0.041816 0.5110399 0.7565751 0.0783537 0.0460041 0.080081 -0.0417725 -0.1840295 -0.0227287 0.0068311 -0.0435293 -0.1658111 -0.0140523 0.0039205 -0.0157524 -0.0454398 0.9341655 -0.3144473 -0.1159432 -0.2686208 -0.0805569 0.0164778 -0.1094076 0.0196016 -0.05181 -0.0256682 -0.0579112 -0.0005097 -0.0741284 0.132265 0.0143739 -0.0047977 0.0139555 0.0731119 0.0843685 0.0309578 0.009309 0.0234713 -0.0024116 -0.023164 0.0081515 -0.0238061 0.1448944 0.0789311 0.016085 0.008791 0.0200252 0.0344087 -0.0206922 0.0096184 -0.0202335 0.1671548 0.0836382 -0.0657119 -0.1072568 0.0333339 -0.0324537 -0.0679201 -0.06909 -0.0454668 -0.0321365 -0.0738888 0.0509657 0.0201697 0.0355325 0.0834645 -0.0095737 0.0181855 -0.0107711 0.1335549 0.103396 -0.0834594 0.0718368 0.024183 -0.0608925 0.057834 0.0611025 0.0493552 -0.0224613 unknown
polarizability: 181.2774708|4.836182|138.3757616|-8.7619012|12.3435095|49.9604747 unknown
InChI: InChI=1S/C7H5Cl3S/c1-11-7-3-5(9)4(8)2-6(7)10/h2-3H,1H3
charge 0 multiplicity 1
16 atoms
Cl -1.632178 -2.815417 -0.154833
Cl 2.272686 2.264069 0.284345
Cl 3.49587 -0.75895 -0.232239
S  -2.905974 0.082627 0.344397
C  -1.094683 -0.081158 0.192263
C  -0.538805 -1.368621 -0.029098
C  -0.197243 1.010397 0.282686
C  1.192609 0.816821 0.155745
C  0.844456 -1.573592 -0.157547
C  1.720067 -0.47137 -0.064596
C  -3.09666 1.933461 0.600705
H  -0.563516 2.025156 0.453256
H  1.241225 -2.577513 -0.327712
H  -2.602546 2.255985 1.530366
H  -4.182044 2.094724 0.690161
H  -2.715664 2.492579 -0.267999
