program: Gaussian 09
title: 000077785
version: EM64L-G09RevD.01
frameworkgroup: C1[X(C11H12O2)]
method: RPBEPBE
basis: SDD
operation: Freq
keyword: #pfreq=noraman
keyword: PBEPBE/SDD
title: #p freq=noraman PBEPBE/SDD
converged: YES YES NO NO
title: Mulliken charges:
elementType: O O C C C C C C C C C C C H H H H H H H H H H H H
charge: -0.205646 -0.267858 -0.568948 0.364113 0.369423 -0.509916 -0.674087 0.194400 -0.568237 -0.445834 0.338162 -0.371891 -0.537197 0.229002 0.215638 0.250700 0.248698 0.249296 0.262969 0.264104 0.234990 0.242200 0.245293 0.220406 0.220220
chargesum: 0.00000
title: Mulliken charges with hydrogens summed into heavy atoms:
elementType: O O C C C C C C C C C C C
charge: -0.205646 -0.267858 -0.124308 0.364113 0.369423 -0.010518 -0.161822 0.194400 -0.304133 -0.210844 0.338162 -0.129691 0.148721
polarizability: 1.73049080e+02 3.62723495e-01 1.20878673e+02 3.57385556e+00 -2.72053863e+00 7.07632459e+01
1716.lowfreq: -5.3423 -0.0008 -0.0003 -0.0002 1.7131 11.0320 35.3380 75.4004 115.1094
frequency: 35.2892 75.3946 115.1087 157.5869 195.5638 218.9160 242.1354 293.8153 327.9898 368.8454 398.1015 425.5829 458.5983 489.2293 516.8641 542.8237 584.4843 638.0463 681.9866 719.3165 743.2447 760.2839 807.0298 856.8191 877.7012 897.7520 919.8350 936.8839 981.5867 1003.8881 1028.2744 1112.0173 1113.9858 1122.7778 1140.6892 1160.8385 1168.8193 1185.7264 1205.2723 1234.0688 1249.6881 1260.4062 1291.0739 1299.2787 1335.9208 1387.8129 1418.8838 1425.7117 1431.8223 1441.0914 1466.1009 1469.3724 1473.4847 1497.0414 1585.1707 1624.7998 1635.1363 2938.3727 2958.0949 2963.7685 2980.9363 3045.4678 3046.3920 3060.9860 3063.4624 3123.2024 3124.9754 3149.5791 3163.7535
redmass: 5.3126 3.1159 3.3223 2.9974 2.6821 2.0312 1.4244 3.2395 2.9470 5.3184 6.4495 2.9268 2.9752 3.8240 3.2772 2.8970 3.7977 3.6350 3.7900 4.7277 2.9085 3.8178 1.4074 1.5698 2.7840 1.5693 3.6186 1.3647 2.1428 4.0696 2.3612 1.2604 1.5013 1.4209 1.5172 2.1727 1.5563 1.2906 2.0546 1.8016 2.1188 1.8813 1.4238 1.4868 1.7607 5.4845 1.1809 1.0904 1.5557 1.8283 1.0509 1.1190 1.0848 2.6856 7.1540 8.4229 8.7771 1.0684 1.0331 1.0677 1.0635 1.1039 1.0946 1.0959 1.0900 1.0911 1.0974 1.0920 1.0938
irintensity: 3.4031 8.4614 2.1359 1.0863 4.8331 0.9868 0.1162 1.7542 2.7896 9.2456 1.5940 0.6190 10.7982 2.6565 7.2612 5.7401 5.2664 3.0994 11.2231 2.2944 4.1973 1.5176 41.6823 2.3491 1.3250 23.8592 3.2244 1.9780 6.0280 54.2069 5.5228 0.2546 11.2090 28.3956 19.8326 42.7545 78.1963 3.9359 28.7318 41.2598 68.1629 7.6974 8.0438 5.6669 15.1147 11.7844 12.0119 15.7121 28.1377 4.1123 13.9339 21.4340 33.9169 90.7348 31.5227 232.9635 44.7143 14.6797 70.5710 30.7678 14.7921 49.4226 27.0820 23.1127 5.1904 31.5294 8.2620 3.5664 14.0674
temp: 298.150 k
press: 1.00000 atm
elementType: 8 8 6 6 6 6 6 6 6 6 6 6 6 1 1 1 1 1 1 1 1 1 1 1 1
symmnumber: 1
zpe: 530274.4 jmol-1
zpe.correction: 0.201971 hartree
zpe.thermalcorrener: 0.213516 hartree
zpe.thermalcorrenthalpy: 0.214460 hartree
zpe.thermalcorrgfe: 0.164043 hartree
zpe.sumelectzpe: -575.858080 hartree
zpe.sumelectthermal: -575.846535 hartree
zpe.sumelectthermalent: -575.845591 hartree
zpe.sumelectthermalfe: -575.896008 hartree
dipole: -3.4442 3.1714 0.5886
dipole: 4.7187
quadrupole: -77.3319 -75.2143 -77.4917
quadrupole: 5.5263 5.2783 -2.4307
quadrupole: -0.6526 1.4650 -0.8123 5.5263 5.2783 -2.4307
hfenergy: -576.0600508 hartree
pointgroup: C01 [X(C11H12O2)]
dipole: -1.3332673 -1.2165472 -0.4347295 debye
dipolederiv: -0.931723 -0.2499849 -0.1947877 -0.2719856 -0.6431469 -0.0757563 -0.2584554 -0.090612 -0.4062192 -1.7123086 0.2408784 0.0920398 0.446047 -0.4018935 -0.0319202 0.1293071 -0.0244318 -0.3078485 0.0486768 0.0195048 -0.0393285 -0.0350968 0.1344855 -0.0144536 0.0070798 -0.0320957 0.1448156 0.0078659 -0.1490417 -0.0231407 -0.2072615 -0.1942746 -0.0140196 -0.0916146 0.0207975 -0.0925217 0.3170983 0.0380258 -0.0244296 0.2442267 0.1920392 0.0382053 -0.0874866 -0.0328732 -0.0453094 -0.0008457 0.0290078 -0.0488652 -0.0000577 -0.3845055 0.0695079 0.0036208 0.1395432 0.0675419 -0.3232387 0.0257229 -0.1859199 0.1550407 -0.0414372 0.1314333 -0.2211769 0.1207513 -0.0351614 1.0971919 0.1505018 0.3933881 0.0796381 0.8974724 -0.0876199 0.4770778 -0.046865 0.3058862 -0.5002498 0.1119999 0.003294 -0.1176871 0.0316576 0.0072486 0.0366992 0.0033082 -0.1738812 0.1429184 0.117702 -0.0171969 -0.0210587 0.1273391 0.0212898 -0.0193166 0.0091816 -0.1429078 1.3202373 -0.3850316 -0.0979001 -0.7351922 0.2736097 0.0578652 -0.1243798 0.0432858 0.109407 -0.2540067 -0.0059483 -0.0123786 0.3840437 -0.1630224 -0.023047 0.0299865 -0.0015371 -0.212037 0.8413809 0.0078515 -0.028344 0.3365496 0.2215786 -0.0246058 -0.0188104 -0.0067206 0.3279399 0.0405235 -0.0578796 -0.0067474 0.0232036 -0.1648523 0.010219 -0.0290039 0.0412299 0.0802138 -0.0714825 0.0374135 0.0703685 0.0031512 0.084679 0.0385488 0.0830246 -0.0263982 -0.1227995 -0.156585 0.0638237 -0.0127595 0.0256155 0.050281 -0.0125565 -0.0112683 -0.0387876 0.1015571 0.117328 -0.0399932 0.0645161 -0.0272181 0.0578869 -0.0100467 0.0185407 -0.0068593 -0.0709419 -0.0210684 -0.0493878 0.0494248 -0.0362463 0.1027409 -0.0168028 0.0864959 0.0328255 -0.0338124 0.0206051 0.035987 -0.0061568 -0.0062385 -0.0607698 -0.0473591 -0.0128491 -0.0750492 0.0948364 0.0994253 -0.0050263 0.0045106 0.0167652 -0.0575513 -0.0137957 0.0016223 -0.0162972 0.1602249 0.0716866 0.0408596 0.005826 0.014895 -0.1177688 -0.0156788 -0.0012821 -0.0096714 0.1426683 -0.0673265 -0.0840288 0.0097258 -0.0938117 0.0524308 0.000249 0.0110735 0.0017738 0.1695268 -0.0839204 0.0885977 0.0187631 0.142454 0.0027619 -0.0168959 0.0236246 -0.0137144 0.1203466 0.0011498 0.0181865 -0.0262871 -0.1535835 -0.0129728 0.1369673 0.0319593 0.106275 -0.0791186 -0.0033327 0.0002593 0.0123855 -0.1661924 0.0132323 -0.1069764 -0.0644686 -0.0970591 -0.1024058 unknown
polarizability: 173.1644349|0.0600645|120.8364171|1.0410281|3.0864636|70.6901465 unknown
InChI: InChI=1S/C11H12O2/c1-13-11-5-3-8-2-4-10(12)6-9(8)7-11/h3,5,7H,2,4,6H2,1H3
charge 0 multiplicity 1
25 atoms
O  3.779925 1.333164 0.863903
O  -3.307483 1.022319 0.150333
C  1.802744 -1.583315 -0.346431
C  0.418577 -0.963429 -0.234607
C  0.325626 0.457131 -0.151214
C  2.788448 -0.887207 0.624308
C  1.603009 1.276231 -0.234743
C  2.81349 0.634272 0.462117
C  -0.931799 1.075564 -0.019228
C  -0.765112 -1.728083 -0.186815
C  -2.113166 0.293592 0.020356
C  -2.036006 -1.117782 -0.065948
C  -4.558463 0.262679 0.198961
H  1.763576 -2.666368 -0.13134
H  2.187065 -1.482504 -1.383205
H  3.821878 -1.264125 0.521216
H  2.479326 -1.091347 1.670547
H  1.901944 1.387593 -1.302119
H  1.476936 2.301967 0.15232
H  -1.025078 2.164232 0.053058
H  -0.70195 -2.821589 -0.242465
H  -2.935313 -1.73967 -0.032637
H  -5.349998 1.019358 0.302111
H  -4.581131 -0.421809 1.069475
H  -4.715145 -0.316373 -0.732152
