program: Gaussian 09
title: 000086382
version: EM64L-G09RevD.01
frameworkgroup: C1[X(C5H3Cl3O4)]
method: RPBEPBE
basis: SDD
operation: Freq
keyword: #p
keyword: freq=noraman
keyword: PBEPBE/SDD
title: #p freq=noraman PBEPBE/SDD
converged: YES YES NO NO
title: Mulliken charges:
elementType: Cl Cl Cl O O O O C C C C C H H H
charge: 0.059647 0.046472 0.052243 -0.377795 -0.388196 -0.173609 -0.241689 0.617421 -0.828865 -0.339041 0.122727 0.249532 0.404744 0.395404 0.401004
chargesum: 0.00000
title: Mulliken charges with hydrogens summed into heavy atoms:
elementType: Cl Cl Cl O O O O C C C C C
charge: 0.059647 0.046472 0.052243 0.017610 0.012808 -0.173609 -0.241689 0.617421 -0.424120 -0.339041 0.122727 0.249532
polarizability: 1.30871227e+02 7.79005420e-01 9.75960241e+01 1.29890186e+00 -1.86258188e+00 7.61209582e+01
1716.lowfreq: -7.1149 -4.7234 0.0012 0.0015 0.0021 5.7688 31.4529 42.6591 55.1170
frequency: 31.3180 42.6462 55.1154 66.5746 118.0213 139.0377 144.7705 191.2493 235.7477 263.1744 295.5822 324.1828 348.9202 416.2808 454.1364 531.1609 598.9770 599.6068 617.5630 647.7902 665.4179 696.5882 727.9603 761.2274 862.5363 957.5845 1036.7438 1072.5371 1175.0995 1211.0808 1255.8322 1316.9029 1330.7735 1593.7546 1607.0162 1652.1766 3167.0217 3506.3073 3521.4312
redmass: 14.3230 13.0414 13.6026 14.0010 14.4311 9.5269 11.8362 21.1981 12.8808 11.9312 14.6133 13.0235 6.9647 14.7599 4.4900 3.7488 2.4906 2.0430 1.5157 6.2937 4.6827 7.1236 7.3796 10.4109 6.6482 10.7981 3.5567 2.1357 3.1318 1.0850 1.2038 2.9113 2.6180 11.3579 8.7936 10.2383 1.0890 1.0641 1.0644
irintensity: 0.1632 1.3893 1.0285 1.8906 0.9532 2.1631 0.1629 0.5686 0.8780 0.9146 0.1865 1.0521 4.4363 1.7686 6.5747 82.7772 180.8658 176.7327 32.7979 87.0733 14.5011 78.5977 19.8951 3.3224 1.3971 18.4869 218.0673 436.7685 81.8939 11.3688 6.8314 71.0499 118.8031 24.8390 149.8284 185.4018 24.0693 48.8385 78.7717
temp: 298.150 k
press: 1.00000 atm
elementType: 17 17 17 8 8 8 8 6 6 6 6 6 1 1 1
symmnumber: 1
zpe: 204799.8 jmol-1
zpe.correction: 0.078004 hartree
zpe.thermalcorrener: 0.090970 hartree
zpe.thermalcorrenthalpy: 0.091914 hartree
zpe.thermalcorrgfe: 0.035773 hartree
zpe.sumelectzpe: -1872.480709 hartree
zpe.sumelectthermal: -1872.467743 hartree
zpe.sumelectthermalent: -1872.466799 hartree
zpe.sumelectthermalfe: -1872.522940 hartree
dipole: -2.7471 0.1743 -1.5200
dipole: 3.1444
quadrupole: -85.6233 -80.1531 -93.3813
quadrupole: 8.8624 -1.8753 -3.0740
quadrupole: 0.7625 6.2328 -6.9954 8.8624 -1.8753 -3.0740
hfenergy: -1872.558713 hartree
pointgroup: C01 [X(C5H3Cl3O4)]
dipole: 0.9803466 0.4561231 0.6011078 debye
dipolederiv: -0.2115255 -0.1415937 -0.156248 -0.1719927 -0.2550556 -0.1487626 -0.1463174 -0.2053134 -0.5789363 -0.3730566 -0.1783399 0.3094701 -0.1574058 -0.2487702 0.108199 0.2282483 0.1221754 -0.4711046 -0.1269023 -0.0691773 0.0032491 -0.3101776 -0.6519777 -0.0163006 -0.0199519 -0.0024232 0.0266796 -0.3581009 0.0188064 0.1681648 0.0694018 -0.4712798 -0.3709542 0.219676 -0.3363299 -0.9692489 -1.3078123 -0.4148303 0.0034507 -0.4075812 -0.3671926 0.0160255 0.0021403 0.0209074 -0.3950573 -0.6653573 0.1225184 -0.2766311 0.2714584 -0.4025213 0.0863048 -0.028959 -0.1113774 -0.7083167 -0.7574837 0.1352236 0.0215837 0.0441925 -0.9069131 -0.0000852 0.0310138 -0.0181387 -0.2840164 0.0085038 -0.131042 0.0230688 0.0557859 -0.3068829 -0.027731 0.0753577 0.0461845 -0.1469636 0.4761673 0.3629909 -0.1426064 0.5188441 0.6153692 0.0287004 -0.1747393 0.0713148 1.1731583 -0.4075063 0.311247 -0.0244836 0.550292 0.8546821 0.013217 0.0691635 -0.0094711 -0.054236 0.9244528 -0.3044586 0.1544221 -0.5497617 0.6192348 0.2974338 -0.1102945 0.3747932 1.4067608 2.0125061 0.0810351 -0.0174522 -0.0690392 1.00197 -0.0038651 -0.0368848 0.0011024 0.2905551 0.1654778 0.031103 -0.0048353 -0.0547417 0.0672762 -0.0047265 -0.0024659 -0.0130292 -0.0196747 0.2163993 0.095415 -0.0653311 0.0923718 0.297168 0.036283 -0.1071372 0.0694005 0.3270613 0.4042379 0.0811022 0.0041785 0.1183534 0.1548928 -0.0137382 0.0011504 -0.0097951 0.4033394 unknown
polarizability: 123.9978364|13.9357856|102.7535036|-1.8069983|5.954903|77.8368688 unknown
InChI: InChI=1S/C5H3Cl3O4/c6-2(5(11)12)1(3(7)8)4(9)10/h3,9,11H
charge 0 multiplicity 1
15 atoms
Cl -1.462194 -1.838462 -1.756282
Cl -2.023522 -1.808049 1.258455
Cl 1.257184 2.248604 -0.011173
O  -1.608076 1.587947 1.321386
O  3.320268 0.288782 -0.136999
O  -2.278213 1.287105 -0.889294
O  2.098189 -1.676469 -0.169988
C  -0.369315 0.027548 -0.003388
C  -0.757488 -1.426659 -0.068918
C  0.928126 0.466539 -0.041524
C  -1.510892 1.024967 0.056008
C  2.131757 -0.420245 -0.124553
H  0.082461 -2.109959 0.081266
H  -2.367627 2.232722 1.349747
H  4.083742 -0.34887 -0.186744
