program: Gaussian 09
title: 000086379
version: EM64L-G09RevD.01
frameworkgroup: C1[X(C9H13NO3)]
method: RPBEPBE
basis: SDD
operation: Freq
keyword: #p
keyword: freq=noraman
keyword: PBEPBE/SDD
title: #p freq=noraman PBEPBE/SDD
converged: YES YES NO NO
title: Mulliken charges:
elementType: O O O N C C C C C C C C C H H H H H H H H H H H H H
charge: -0.373814 -0.421655 -0.258066 -0.149639 0.276419 -0.425331 -0.532149 -0.004710 -0.182541 -0.322189 0.131492 -0.649596 -0.310795 0.230128 0.245726 0.214259 0.232015 0.234193 0.244328 0.203412 0.226086 0.236834 0.221770 0.249493 0.342307 0.342025
chargesum: 0.00000
title: Mulliken charges with hydrogens summed into heavy atoms:
elementType: O O O N C C C C C C C C C
charge: -0.031507 -0.079631 -0.258066 -0.149639 0.276419 0.050523 -0.085876 -0.004710 0.051653 0.125551 0.131492 0.035094 -0.061302
polarizability: 1.57051572e+02 -1.04137791e+01 1.22218840e+02 -9.83932792e+00 -7.05418856e+00 7.27231790e+01
1716.lowfreq: -7.5711 -0.0009 -0.0005 -0.0002 5.2463 15.0796 49.2015 61.6406 71.6887
frequency: 49.1884 61.6268 71.5801 87.4928 112.7456 140.6616 204.8919 223.5639 272.4239 279.9361 297.5973 319.6983 332.3086 337.9708 364.9362 407.2644 471.9878 504.5810 540.1600 566.4479 600.8014 648.2964 735.6376 760.4293 776.4042 807.2740 814.6298 874.7445 928.2728 949.5386 971.5196 998.9467 1028.0883 1046.9458 1060.8916 1078.1164 1115.9652 1168.2142 1195.7927 1210.6257 1225.5425 1263.4811 1275.5193 1301.4786 1312.7963 1337.7388 1349.1470 1381.2838 1391.6897 1395.8492 1458.2028 1470.8037 1473.3075 1480.7162 1490.6406 1516.5706 1546.6100 1558.3939 1632.0569 2971.9476 2974.9378 2985.7346 3023.9151 3040.7434 3075.2095 3083.1523 3088.5279 3096.5312 3153.4079 3184.6875 3566.8024 3570.2175
redmass: 5.9730 4.9799 2.6786 4.0313 2.0335 4.7588 1.0407 3.7706 1.1726 1.1426 6.4515 6.9467 4.3115 4.6051 3.2157 2.2995 6.4062 4.7576 4.1697 3.8753 5.1597 4.7999 3.4212 1.3778 3.8407 1.1723 1.7847 2.2571 1.2909 2.5746 3.9338 2.5390 4.3921 1.6128 1.9068 1.4421 2.1548 1.2430 3.2180 1.6101 1.8935 1.5423 1.4232 1.2561 1.4292 1.8812 1.3428 1.3180 1.5162 1.3211 3.4131 1.0489 1.1398 1.0699 1.1249 1.0961 6.7218 8.6919 6.7932 1.0683 1.0692 1.0356 1.0614 1.0904 1.0982 1.1003 1.1005 1.1023 1.0886 1.0978 1.0651 1.0667
irintensity: 3.3108 4.6128 1.4359 3.9967 8.5824 0.1635 1.3930 1.2707 71.8246 168.5465 17.5607 13.2866 2.1386 19.5707 4.5867 2.4042 4.1334 7.0345 10.3889 10.9058 2.1884 5.6297 3.3619 5.0042 7.5323 5.5150 45.6727 7.2693 0.7544 33.9049 117.7667 28.7096 28.5629 22.0272 10.8682 59.7652 66.0089 8.8761 47.2073 80.5716 51.2811 70.3939 1.9404 1.3180 0.5588 22.7051 16.9449 2.2340 17.6505 15.3011 15.1923 9.2590 10.3969 3.7718 32.0733 9.8775 52.1655 87.0721 276.6610 39.5123 30.0272 27.3254 35.5882 23.8035 2.3921 37.3967 33.2801 28.8667 4.6967 5.3296 15.9227 13.1941
temp: 298.150 k
press: 1.00000 atm
elementType: 8 8 8 7 6 6 6 6 6 6 6 6 6 1 1 1 1 1 1 1 1 1 1 1 1 1
symmnumber: 1
zpe: 550855.5 jmol-1
zpe.correction: 0.209810 hartree
zpe.thermalcorrener: 0.223547 hartree
zpe.thermalcorrenthalpy: 0.224491 hartree
zpe.thermalcorrgfe: 0.169171 hartree
zpe.sumelectzpe: -630.143322 hartree
zpe.sumelectthermal: -630.129585 hartree
zpe.sumelectthermalent: -630.128641 hartree
zpe.sumelectthermalfe: -630.183961 hartree
dipole: -7.7731 4.2671 1.0012
dipole: 8.9237
quadrupole: -107.7794 -67.6636 -77.8916
quadrupole: -0.5966 1.1229 -4.4772
quadrupole: -23.3345 16.7813 6.5532 -0.5966 1.1229 -4.4772
hfenergy: -630.3531322 hartree
pointgroup: C01 [X(C9H13N1O3)]
dipole: 3.149531 1.486489 -0.4436022 debye
dipolederiv: -0.4091637 0.4578146 0.1199938 0.6128571 -0.8021603 -0.2152657 0.1585354 -0.1595087 -0.44678 -1.0593782 0.0336596 -0.0841692 0.0270254 -0.1020494 -0.0178294 -0.0996709 -0.0431459 -0.5728571 -1.3334829 -0.183865 0.1261506 -0.1351227 -0.4197535 0.0180916 0.1445017 0.0193803 -0.3870517 -1.0856577 -0.1675618 0.0429702 -0.1142404 -0.501192 -0.0758547 0.1563385 -0.0393633 -0.190466 0.4065805 0.1656367 -0.0600569 -0.3467206 0.2306791 0.0977439 -0.258373 0.0339591 -0.0764803 0.6572559 0.0289739 -0.0147458 0.0734861 0.1778088 -0.0302094 -0.1783083 -0.0325665 0.1331544 0.160852 -0.0364238 -0.0240605 0.0218187 0.0218702 -0.0048037 0.0619195 0.0669186 0.1217668 -0.0789333 -0.5886033 -0.1232278 -0.9044864 0.4349321 0.2730053 -0.2093251 0.1869679 0.1180917 0.5743819 0.3510236 -0.0117114 0.4650042 0.311202 0.0709007 -0.0067233 0.0420136 -0.0705565 0.7533783 -0.0279192 0.021705 0.0022568 0.217802 0.0272835 0.0884052 0.0418278 0.3028983 1.500393 0.1872129 -0.2004911 0.1748423 0.3931053 0.005721 -0.2081134 0.0182195 0.1956797 0.0067865 -0.0214829 -0.0000636 -0.0300994 0.0238645 0.0337897 -0.0564584 -0.0101211 0.0012546 -0.5684342 -0.0684842 0.0149388 0.3522386 -0.0154945 -0.0006753 0.1517863 0.0728955 -0.2172442 -0.0249696 -0.0553858 0.0053099 -0.1158078 -0.0792385 0.1034489 -0.0196886 0.0622699 0.0426014 0.0266632 -0.0004703 0.0040032 0.0788091 -0.0053071 -0.1060188 0.0131664 -0.0608179 -0.0099835 0.0268303 0.0894834 0.1355288 0.0077264 -0.0213328 -0.0558113 0.064003 -0.056777 -0.0623268 -0.1625777 -0.010807 -0.0874187 0.0195931 0.0611727 0.0512163 -0.0455325 0.0466572 0.040429 0.0079461 0.100974 0.06067 0.0676685 0.0237497 -0.0416045 0.0505233 -0.051796 0.1380925 0.0216728 -0.0442648 0.0177636 -0.0594986 -0.0541915 0.0772526 0.0277934 0.0309548 0.0593566 -0.0424152 0.0448241 0.0502022 0.0603126 -0.0417909 -0.142024 0.0525636 -0.100515 -0.0542155 0.0435268 -0.1195004 -0.0095431 -0.1276575 -0.1663697 0.010413 -0.0040958 -0.0087374 0.0642553 -0.0971231 0.0605152 -0.0735257 0.0168051 0.093958 0.0217217 -0.0240707 0.0057879 0.0651039 0.0382505 0.0410647 0.0945401 0.0803942 0.0368474 -0.0949901 0.0706534 -0.0577338 -0.0410743 0.0640567 -0.057258 0.0018468 -0.0327275 -0.024259 -0.0452499 0.0159417 -0.0442849 0.1552226 0.2227956 -0.1701833 -0.0407162 -0.1486008 0.1994897 -0.0040913 -0.0201798 -0.0174221 0.3326332 0.3507654 -0.0089728 0.034107 -0.0458765 0.0066576 0.0438399 0.0744084 0.0549376 0.3584959 unknown
polarizability: 158.1527986|8.0067891|121.637511|-9.5881202|5.8290783|72.2032816 unknown
InChI: InChI=1S/C9H13NO3/c1-2-7-9(13)8(12)3-4-10(7)5-6-11/h3-4,11,13H,2,5-6H2,1H3
charge 0 multiplicity 1
26 atoms
O  -2.316038 1.565832 0.662189
O  4.301379 -0.822625 0.530419
O  -3.479975 -0.907271 0.283384
N  0.630523 -0.46648 -0.381657
C  -0.122409 0.645947 0.06235
C  2.102112 -0.415908 -0.542895
C  0.564669 1.993613 0.222421
C  -1.494698 0.501677 0.268341
C  -0.002815 -1.689917 -0.578841
C  2.859422 -0.723746 0.774428
C  -2.225309 -0.779361 0.081303
C  0.507546 2.860642 -1.066139
C  -1.353779 -1.865356 -0.368033
H  2.410737 0.565093 -0.944815
H  2.397371 -1.172691 -1.290089
H  0.095664 2.547567 1.061197
H  1.615022 1.866755 0.539388
H  0.643864 -2.504605 -0.917532
H  2.56466 -1.716344 1.151824
H  2.622277 0.028858 1.55526
H  0.987747 3.842689 -0.904795
H  -0.536222 3.032061 -1.383935
H  1.024175 2.359711 -1.904609
H  -1.812204 -2.842084 -0.544508
H  -1.798951 2.400388 0.789408
H  4.686032 0.080557 0.402235
