program: Gaussian 09
title: 000086389
version: EM64L-G09RevD.01
frameworkgroup: C1[X(C13H6Br2F6N2O2S)]
method: RPBEPBE
basis: SDD
operation: Freq
keyword: #p
keyword: freq=noraman
keyword: PBEPBE/SDD
title: #p freq=noraman PBEPBE/SDD
converged: YES YES NO NO
title: Mulliken charges:
elementType: Br Br S F F F F F F O O N N C C C C C C C C C C C C C H H H H H H
charge: 0.055422 0.095450 0.271557 -0.151917 -0.142338 -0.143038 -0.156661 -0.114860 -0.159605 -0.232988 -0.165558 -0.484886 0.011629 -0.459598 0.243442 0.699431 0.228752 -0.081730 -0.369390 -0.338729 0.388696 0.287602 -0.293115 -0.368670 -0.722287 0.400205 0.339688 0.298374 0.292533 0.248189 0.251544 0.272854
chargesum: 0.00000
title: Mulliken charges with hydrogens summed into heavy atoms:
elementType: Br Br S F F F F F F O O N N C C C C C C C C C C C C C
charge: 0.055422 0.095450 0.271557 -0.151917 -0.142338 -0.143038 -0.156661 -0.114860 -0.159605 -0.232988 -0.165558 -0.145198 0.011629 -0.459598 0.243442 0.699431 0.228752 -0.081730 -0.369390 -0.338729 0.388696 0.287602 0.005259 -0.076137 0.050300 0.400205
polarizability: 3.07821958e+02 1.22841319e+01 2.48374315e+02 -9.58771423e+00 -4.54594358e+00 1.10171021e+02
1716.lowfreq: -3.2232 -0.0011 -0.0008 -0.0002 2.8478 4.6812 11.5923 12.4671 24.1083
frequency: 11.5314 12.2323 24.0601 26.4874 31.0244 51.3278 60.6854 68.5478 76.9179 81.3206 100.1182 113.7155 123.9747 125.7683 143.8068 168.9996 180.3023 184.9380 199.3961 244.4051 252.4102 264.6386 279.1150 305.9379 326.4926 332.3443 350.0768 370.3754 381.0251 393.4052 421.3103 447.0114 489.8186 491.3568 503.9743 510.2876 528.2322 530.9821 546.3490 551.6336 563.5733 573.1518 605.4941 635.4864 641.1991 684.0074 696.7267 712.6795 734.9391 743.0885 796.6394 830.1973 850.5240 868.4251 882.5915 912.6629 960.4883 989.7108 1005.1225 1021.9842 1036.1659 1036.9878 1049.5438 1067.8288 1116.1067 1129.7366 1145.9006 1178.8044 1200.8215 1219.2199 1276.8300 1320.2820 1348.9053 1392.4635 1398.3005 1445.3874 1453.1906 1455.4218 1464.4466 1528.8297 1546.5562 1560.8927 1594.8562 1617.0018 2995.8399 3077.7333 3120.5438 3191.6193 3197.4784 3510.1117
redmass: 17.7149 13.5649 13.9734 14.3208 18.4512 15.5284 13.9189 8.0422 1.0526 22.3755 14.6670 14.8842 9.7338 12.3072 8.5843 10.9649 4.7989 8.7730 10.1521 20.3893 6.5917 6.1209 8.7153 8.3613 10.4568 12.8143 11.9953 7.7991 10.2418 9.6260 10.5376 10.3112 7.8636 5.0563 4.5340 3.7303 14.5192 5.2482 3.4471 6.0218 5.7977 3.9057 8.0292 13.9366 10.2893 11.1941 5.1362 10.5265 11.8323 11.9850 8.4769 11.6416 1.4807 8.9653 1.4675 10.2938 2.7499 11.7158 12.5922 8.0101 2.8668 1.9206 3.9552 9.1822 4.8630 3.1958 8.3179 2.5541 2.1252 3.7833 2.8957 10.6199 6.5701 3.3069 1.2351 2.2800 1.1130 1.0435 2.7508 10.9418 6.8976 8.2151 7.6518 8.0850 1.0371 1.0980 1.0991 1.0936 1.0938 1.0772
irintensity: 0.6805 0.3076 0.3071 0.8556 0.3297 1.4681 0.0461 0.2068 0.4169 0.3731 0.3625 0.8929 2.4198 1.7616 0.5431 0.6374 0.7070 1.1490 0.6264 0.6054 13.2593 4.0061 1.7488 2.1695 5.7287 0.5736 7.1367 14.5584 4.7819 2.2695 2.3667 2.3180 1.5435 8.5771 6.6929 11.1536 5.4065 7.7803 37.2567 13.2597 15.7789 4.7468 12.5192 12.3776 4.2579 4.4800 14.4778 46.1119 32.3687 8.4146 87.7479 43.4381 6.0956 13.3146 27.5363 19.6150 56.2831 315.4197 232.1427 10.5910 200.1291 109.9269 4.4182 343.9086 88.6835 36.3167 900.1451 376.3719 112.6399 125.7795 9.8298 91.0667 84.5728 37.9586 17.3795 34.6142 24.9682 22.7005 454.4074 50.1648 54.3151 116.4122 79.3142 121.0935 6.4755 7.2648 2.3280 3.6779 3.5091 26.4673
temp: 298.150 k
press: 1.00000 atm
elementType: 35 35 16 9 9 9 9 9 9 8 8 7 7 6 6 6 6 6 6 6 6 6 6 6 6 6 1 1 1 1 1 1
symmnumber: 1
zpe: 458725.0 jmol-1
zpe.correction: 0.174719 hartree
zpe.thermalcorrener: 0.200707 hartree
zpe.thermalcorrenthalpy: 0.201651 hartree
zpe.thermalcorrgfe: 0.112095 hartree
zpe.sumelectzpe: -1781.067639 hartree
zpe.sumelectthermal: -1781.041651 hartree
zpe.sumelectthermalent: -1781.040706 hartree
zpe.sumelectthermalfe: -1781.130263 hartree
dipole: 0.6128 5.4850 -3.6521
dipole: 6.6181
quadrupole: -184.0401 -162.4174 -177.1262
quadrupole: 27.8870 -6.2239 1.1015
quadrupole: -9.5122 12.1105 -2.5983 27.8870 -6.2239 1.1015
hfenergy: -1781.2423577 hartree
pointgroup: C01 [X(C13H6Br2F6N2O2S1)]
dipole: 0.2980376 -2.5092875 0.6277951 debye
polarizability: 307.9048604|-14.365032|234.1251176|13.2012693|40.4214945|124.337316 unknown
InChI: InChI=1S/C13H6Br2F6N2O2S/c1-4-22-10(12(16,17)18)9(26-4)11(24)23-8-6(14)2-5(3-7(8)15)25-13(19,20)21/h2-3,23H,1H3
charge 0 multiplicity 1
32 atoms
Br -1.174882 -2.942681 -0.72121
Br -0.417691 2.255446 1.833243
S  3.102375 -2.213556 -0.227568
F  3.047479 2.232865 1.171219
F  5.272575 1.899123 1.410015
F  4.430687 2.435121 -0.621459
F  -5.845078 -0.517678 -1.765489
F  -7.285591 0.525386 -0.350505
F  -6.223818 -1.376082 0.300575
O  -5.103586 0.670702 0.110262
O  1.19021 1.111285 -0.847285
N  0.420253 -0.576814 0.586251
N  5.162627 -0.576785 0.183841
C  2.795492 -0.453796 0.055787
C  4.006167 0.205406 0.24852
C  -0.96875 -0.278881 0.468686
C  1.416694 0.116241 -0.111281
C  4.91395 -1.848723 -0.051272
C  -1.866349 -1.225721 -0.095108
C  -1.525727 0.949963 0.925085
C  -3.729411 0.264651 0.197912
C  4.183186 1.672561 0.54258
C  -3.24637 -0.985411 -0.234793
C  -2.894967 1.236629 0.775267
C  5.928199 -2.939698 -0.191466
C  -6.077546 -0.15469 -0.412434
H  0.690835 -1.404541 1.125089
H  -3.894494 -1.743745 -0.676529
H  -3.319162 2.184092 1.114006
H  5.785085 -3.727748 0.569634
H  5.871835 -3.419204 -1.185166
H  6.932371 -2.505518 -0.065409
