program: Gaussian 09
title: 000086349
version: EM64L-G09RevD.01
frameworkgroup: C1[X(C9H22O3Si)]
method: RPBEPBE
basis: SDD
operation: Freq
keyword: #p
keyword: freq=noraman
keyword: PBEPBE/SDD
title: #p freq=noraman PBEPBE/SDD
converged: NO YES NO NO
title: Mulliken charges:
elementType: Si O O O C C C C C C C C C H H H H H H H H H H H H H H H H H H H H H H
charge: 1.540612 -0.613134 -0.619152 -0.600635 -0.879746 -0.021123 -0.690300 -0.702100 0.072686 -0.677172 -0.673251 -0.478839 -0.482239 0.246491 0.240428 0.229779 0.196614 0.204629 0.253388 0.203733 0.212133 0.215371 0.188641 0.201789 0.244677 0.219089 0.199231 0.216902 0.224845 0.222932 0.239821 0.208700 0.226198 0.214040 0.214961
chargesum: 0.00000
title: Mulliken charges with hydrogens summed into heavy atoms:
elementType: Si O O O C C C C C C C C C
charge: 1.540612 -0.613134 -0.619152 -0.600635 -0.392827 0.208655 -0.035668 -0.070863 0.261327 -0.011617 -0.032273 0.192615 0.172960
polarizability: 1.41877692e+02 -1.32692166e+00 1.26996103e+02 5.62220804e-01 1.60836530e+00 1.22139697e+02
1716.lowfreq: -15.3907 -10.5812 -6.6930 -0.0006 -0.0005 0.0010 8.7098 13.0078 32.6825
frequency: 4.1948 10.0858 32.6052 39.8957 46.6520 58.5488 80.3115 96.3211 104.9885 122.8030 124.5080 167.6651 188.0866 195.3306 202.5574 208.6638 234.3477 240.2348 274.9598 295.0758 315.4237 356.3707 372.5557 396.6839 409.3204 427.9648 464.4620 573.2657 675.0182 693.1003 758.8679 805.8993 832.2123 866.5669 916.9736 923.7876 932.8521 953.5053 958.6107 974.9262 1054.2375 1058.0385 1070.1915 1106.4262 1111.5801 1123.2368 1127.9196 1145.0338 1147.9168 1152.0230 1175.6303 1177.2760 1212.1757 1241.9211 1322.9660 1330.5839 1332.9511 1333.2519 1373.6341 1375.8178 1388.6868 1394.4295 1418.6092 1442.2379 1445.4250 1451.7518 1463.8772 1465.1793 1466.6919 1469.8878 1473.1558 1475.2024 1476.3090 1479.3722 1482.4637 1485.2792 1488.8843 2943.3116 2948.8680 2961.1829 2964.1210 2970.1392 2974.6919 2979.7498 2984.7620 2985.8229 3033.2496 3037.8180 3055.7364 3057.7079 3066.0229 3066.9608 3076.6695 3077.7139 3080.7170 3083.4270 3085.8950 3089.3357 3095.2632
redmass: 2.6901 2.7907 2.9897 3.0814 2.4715 3.1893 3.3788 1.1606 2.1755 1.3121 3.3406 3.5181 3.5189 1.0340 3.1842 1.0484 1.1870 1.2611 2.6495 2.6228 2.9647 3.2142 3.0722 2.1874 3.0923 3.3757 3.4595 4.1787 3.6737 8.2233 3.7218 2.2418 2.4312 2.8936 1.2239 1.1693 1.3737 1.5283 1.8352 4.2126 5.6383 1.3553 4.7578 1.8248 2.1504 1.2488 1.2347 1.4868 1.9361 1.4630 1.8760 1.9639 1.4831 1.3442 1.2805 1.4067 1.3675 1.3446 1.2604 1.2072 1.2302 1.2019 1.0849 1.1175 1.1216 1.0518 1.0483 1.0490 1.0466 1.0544 1.0518 1.0510 1.0509 1.0474 1.0534 1.0503 1.0506 1.0846 1.0317 1.0297 1.0350 1.0374 1.0635 1.0353 1.0774 1.0358 1.1033 1.1000 1.1031 1.0994 1.0997 1.0984 1.1042 1.0994 1.1008 1.0995 1.0994 1.1009 1.1001
irintensity: 0.0513 3.3238 4.6928 0.8289 2.2866 1.2674 2.5870 0.4285 2.5699 1.6339 12.0722 4.4951 4.8209 0.0099 2.5649 0.2956 4.7718 0.7312 12.8468 5.0021 1.7329 13.2022 16.6640 7.4226 13.0774 14.1751 31.8388 7.5476 38.2666 105.3833 38.6544 61.7168 5.4196 64.7425 2.5775 3.2013 0.2146 0.9480 6.4925 236.6046 221.0155 63.4669 204.3944 105.3927 26.5887 0.5676 2.1577 13.8019 26.4915 39.3937 13.8311 23.3552 1.0664 23.6793 15.4460 3.6385 12.2150 6.8845 28.5652 15.6066 26.7919 14.4369 9.0066 0.1628 1.1800 3.8954 5.9276 3.5967 2.4599 5.9753 4.5440 2.0372 8.9930 14.1400 8.3593 8.6065 15.9259 33.7005 92.8974 101.9597 32.9310 33.5010 8.3993 20.9854 12.0031 25.7941 55.5145 7.1440 42.6662 6.0285 41.4424 92.2027 32.2783 18.0042 39.4133 28.5661 57.1335 18.5042 51.2681
temp: 298.150 k
press: 1.00000 atm
elementType: 14 8 8 8 6 6 6 6 6 6 6 6 6 1 1 1 1 1 1 1 1 1 1 1 1 1 1 1 1 1 1 1 1 1 1
symmnumber: 1
zpe: 787714.8 jmol-1
zpe.correction: 0.300025 hartree
zpe.thermalcorrener: 0.320168 hartree
zpe.thermalcorrenthalpy: 0.321112 hartree
zpe.thermalcorrgfe: 0.246232 hartree
zpe.sumelectzpe: -870.179837 hartree
zpe.sumelectthermal: -870.159693 hartree
zpe.sumelectthermalent: -870.158749 hartree
zpe.sumelectthermalfe: -870.233630 hartree
dipole: -1.4510 -0.5037 -0.6209
dipole: 1.6567
quadrupole: -83.7570 -89.4271 -85.3646
quadrupole: -0.0336 -1.2519 1.5571
quadrupole: 2.4259 -3.2442 0.8183 -0.0336 -1.2519 1.5571
hfenergy: -870.4798615 hartree
pointgroup: C01 [X(C9H22O3Si1)]
dipole: 0.5430668 0.199021 -0.3004751 debye
polarizability: 141.9246211|1.1422975|125.5002426|0.1180934|-2.7410721|123.5886279 unknown
InChI: InChI=1S/C9H22O3Si/c1-8(2)7-13(10-5,11-6)12-9(3)4/h8-9H,7H2,1-6H3
charge 0 multiplicity 1
35 atoms
Si -0.222808 0.656248 -0.302937
O  0.891233 -0.662833 -0.294021
O  -0.355518 1.407642 1.229909
O  0.393703 1.920388 -1.314622
C  -1.917397 0.007732 -0.825794
C  -2.67804 -0.843292 0.23589
C  -2.05116 -2.249045 0.394527
C  -4.173704 -0.952593 -0.147582
C  2.238299 -0.655805 0.32043
C  2.132213 -1.160974 1.770368
C  3.131831 -1.542324 -0.556967
C  0.24062 2.656059 1.687884
C  0.979505 1.768589 -2.639906
H  -2.517796 0.905256 -1.078414
H  -1.808874 -0.575372 -1.76252
H  -2.609685 -0.316842 1.209672
H  -2.153823 -2.825453 -0.545759
H  -2.558801 -2.81557 1.197363
H  -0.974722 -2.187509 0.631977
H  -4.289797 -1.440262 -1.135085
H  -4.649902 0.044431 -0.201775
H  -4.729254 -1.556225 0.594598
H  2.631365 0.384861 0.32105
H  3.126107 -1.16637 2.256103
H  1.453957 -0.517566 2.357515
H  1.730794 -2.190256 1.781508
H  4.156237 -1.596899 -0.144115
H  3.186275 -1.145672 -1.585953
H  2.714128 -2.563652 -0.60238
H  -0.530448 3.216435 2.24528
H  0.599335 3.26602 0.838041
H  1.085985 2.436739 2.36814
H  1.525121 2.700383 -2.865119
H  0.19399 1.620258 -3.407361
H  1.684334 0.914071 -2.681546
