program: Gaussian 09
title: 000086358
version: EM64L-G09RevD.01
frameworkgroup: C1[X(C14H10Cl4)]
method: RPBEPBE
basis: SDD
operation: Freq
keyword: #p
keyword: freq=noraman
keyword: PBEPBE/SDD
title: #p freq=noraman PBEPBE/SDD
converged: YES YES NO NO
title: Mulliken charges:
elementType: Cl Cl Cl Cl C C C C C C C C C C C C C C H H H H H H H H H H
charge: -0.060369 -0.062666 -0.040811 -0.041794 -0.752737 0.682009 0.650027 -0.575315 0.558745 -0.378484 -0.334984 -0.359082 -0.304944 -0.214569 -0.801184 -0.209946 -0.224554 -0.106541 0.255176 0.256080 0.258346 0.257752 0.281657 0.229551 0.247545 0.248184 0.282487 0.260420
chargesum: 0.00000
title: Mulliken charges with hydrogens summed into heavy atoms:
elementType: Cl Cl Cl Cl C C C C C C C C C C C C C C
charge: -0.060369 -0.062666 -0.040811 -0.041794 -0.241482 0.682009 0.650027 -0.316969 0.558745 -0.378484 -0.334984 -0.101329 -0.304944 0.067089 -0.075904 0.072541 0.035865 -0.106541
polarizability: 2.31856766e+02 -2.40125072e+00 1.92465659e+02 -1.88148746e+00 6.03865048e+00 1.36808149e+02
1716.lowfreq: -2.4353 -0.0023 -0.0021 -0.0019 5.1270 8.7004 17.5982 27.7146 32.1393
frequency: 17.0765 27.6905 32.0554 73.6427 103.4697 116.8354 139.2772 146.2041 164.0025 187.2753 192.4454 228.6871 251.9458 290.1862 317.6444 334.0706 362.0433 366.5702 378.7168 409.7153 432.4498 440.9691 466.9432 489.5321 543.3904 580.0801 609.8993 642.1547 661.2270 682.4182 699.9998 718.0864 762.5030 813.5229 838.7253 862.0445 865.0900 903.4866 924.1250 946.7414 965.0547 1007.2533 1020.0091 1043.6440 1048.3255 1083.2453 1131.7764 1162.9250 1180.9401 1202.3285 1240.1968 1261.7840 1269.4338 1312.8060 1357.1200 1362.6109 1373.5478 1377.8744 1402.9978 1450.6816 1458.0242 1461.4948 1473.9912 1478.9303 1566.9165 1571.4033 1593.1717 1598.8538 2987.3880 3024.8124 3066.7497 3082.9409 3099.0397 3132.5491 3143.8686 3177.7764 3182.9430 3184.6654
redmass: 9.3086 10.4097 8.4999 7.5737 5.8785 1.0665 17.6106 6.2482 6.3037 15.5921 13.9788 4.3895 3.7862 7.4725 4.0053 5.5995 7.7209 11.7672 6.8954 4.6057 3.3023 3.1437 4.5276 3.0839 5.1860 5.9102 5.8900 6.0163 5.4175 6.6916 3.7441 6.0109 3.6287 3.0141 1.7375 1.4283 1.4069 1.5136 1.9610 2.6262 1.4177 1.6566 4.2193 5.2666 1.5294 2.3798 1.5635 1.5085 1.2007 2.6760 4.6794 1.2684 1.3659 1.4172 5.2099 6.1427 3.9058 4.8280 1.2277 2.4363 2.4086 1.0449 1.1292 1.2180 8.4248 7.8334 7.2341 6.8416 1.0371 1.0597 1.0972 1.1018 1.0999 1.0918 1.0902 1.0956 1.0933 1.0937
irintensity: 0.4289 0.4526 1.1390 0.0184 0.2869 0.4674 0.0642 0.0604 0.0184 1.4158 0.4520 0.8073 0.9530 0.1708 2.6812 1.9190 5.6009 10.4466 5.5342 1.1826 2.8061 12.6635 16.6929 3.4368 8.3950 3.5443 12.1009 7.6737 11.2860 37.6769 0.4713 20.5998 6.1874 44.7554 34.9762 14.9637 20.1044 12.5378 13.6459 27.1490 0.5224 6.1604 42.3591 68.6337 10.3934 29.2883 1.3291 0.0456 0.6291 0.5297 0.4208 1.6559 1.1910 3.6432 15.1080 0.8962 1.6260 7.2091 20.0182 98.4897 119.0634 16.0904 31.5937 12.6004 31.7486 6.1092 27.0155 10.5438 16.8728 10.2360 11.7637 3.8220 13.3500 2.6664 0.9119 1.2894 0.5771 0.8473
temp: 298.150 k
press: 1.00000 atm
elementType: 17 17 17 17 6 6 6 6 6 6 6 6 6 6 6 6 6 6 1 1 1 1 1 1 1 1 1 1
symmnumber: 1
zpe: 511780.5 jmol-1
zpe.correction: 0.194927 hartree
zpe.thermalcorrener: 0.212329 hartree
zpe.thermalcorrenthalpy: 0.213273 hartree
zpe.thermalcorrgfe: 0.146574 hartree
zpe.sumelectzpe: -2378.468922 hartree
zpe.sumelectthermal: -2378.451520 hartree
zpe.sumelectthermalent: -2378.450576 hartree
zpe.sumelectthermalfe: -2378.517275 hartree
dipole: 0.3178 -0.4973 -0.4068
dipole: 0.7167
quadrupole: -143.6499 -126.2218 -135.4772
quadrupole: -3.1667 0.5195 1.0389
quadrupole: -8.5336 8.8945 -0.3609 -3.1667 0.5195 1.0389
hfenergy: -2378.6638492 hartree
pointgroup: C01 [X(C14H10Cl4)]
dipole: 0.122565 -0.0844731 -0.2394931 debye
polarizability: 231.7885932|-1.632889|171.8680709|-2.9682075|27.59557|157.4739107 unknown
InChI: InChI=1S/C14H10Cl4/c1-8-4-10(14(18)7-12(8)16)5-9-2-3-11(15)6-13(9)17/h2-4,6-7H,5H2,1H3
charge 0 multiplicity 1
28 atoms
Cl 1.58867 3.01636 0.834328
Cl -2.052679 -0.950291 -2.609409
Cl 4.94613 -1.35802 1.145938
Cl -5.249833 -0.836701 1.905982
C  -0.22656 1.196704 -1.085014
C  1.06034 0.592566 -0.526075
C  -1.476359 0.680362 -0.374625
C  1.417561 -0.741594 -0.856414
C  2.584435 -1.383332 -0.37559
C  1.942629 1.287634 0.331868
C  -2.364186 -0.268205 -0.934927
C  -1.793777 1.148743 0.929569
C  3.416479 -0.617487 0.477944
C  3.119955 0.707314 0.841958
C  2.915106 -2.808738 -0.761846
C  -3.512215 -0.742531 -0.26783
C  -2.929212 0.701069 1.635462
C  -3.774628 -0.242602 1.020368
H  -0.292603 0.964524 -2.161467
H  -0.188585 2.294885 -0.984819
H  0.750505 -1.303363 -1.520851
H  -1.128445 1.883361 1.396366
H  3.783716 1.270609 1.5017
H  2.14289 -3.225662 -1.428777
H  3.89049 -2.866883 -1.278691
H  2.991328 -3.457093 0.130164
H  -4.174024 -1.473577 -0.737673
H  -3.151829 1.077946 2.637262
