program: Gaussian 09
title: 000086286
version: EM64L-G09RevD.01
frameworkgroup: C1[X(C8H6Cl2O3)]
method: RPBEPBE
basis: SDD
operation: Freq
keyword: #p
keyword: freq=noraman
keyword: PBEPBE/SDD
title: #p freq=noraman PBEPBE/SDD
converged: NO YES NO NO
title: Mulliken charges:
elementType: Cl Cl O O O C C C C C C C C H H H H H H
charge: 0.006282 0.019249 -0.261858 -0.424664 -0.177903 0.312889 0.642181 -0.498746 0.255166 -0.319989 -0.383131 -0.203810 -0.516960 0.256907 0.194461 0.221737 0.261240 0.242513 0.374437
chargesum: 0.00000
title: Mulliken charges with hydrogens summed into heavy atoms:
elementType: Cl Cl O O O C C C C C C C C
charge: 0.006282 0.019249 -0.261858 -0.050227 -0.177903 0.312889 0.642181 -0.498746 0.255166 -0.319989 -0.126224 -0.009350 0.208531
polarizability: 1.74677064e+02 4.24871527e+00 1.42948278e+02 1.72225634e+00 1.24464475e+00 5.01094987e+01
1716.lowfreq: -1.9167 -0.0013 0.0023 0.0028 5.9295 8.5621 51.0202 67.4287 78.1479
frequency: 51.0187 67.4082 78.1385 101.7585 148.9628 173.3094 201.2995 208.2908 226.7597 265.9354 286.8222 308.6091 331.9076 366.1935 383.2071 392.7400 434.1496 479.8239 539.3104 628.3522 651.8440 723.7508 752.3739 764.2585 822.0079 830.3848 929.4994 980.0480 1016.0469 1105.8250 1112.1962 1153.2959 1209.2808 1213.6967 1270.6168 1333.7797 1369.0025 1422.8584 1432.0290 1454.9916 1463.6784 1477.5442 1556.7349 1584.0167 1612.7553 2958.4690 2987.8956 3097.3494 3139.4279 3143.4475 3578.1897
redmass: 10.3324 2.9992 3.7487 2.9256 1.3967 4.2641 5.0449 17.5763 12.2923 5.5542 5.7270 6.9735 8.1672 2.8561 1.8278 8.5603 5.9314 7.1072 4.4178 7.1140 5.9139 10.8263 6.4129 4.7684 7.5490 1.6034 10.2516 1.8373 6.2432 1.9365 1.3446 1.3352 2.0375 2.2562 4.0780 5.1108 5.8352 1.3625 1.2979 1.6945 1.5809 1.0633 6.7092 7.1651 7.6606 1.0854 1.0324 1.1012 1.1044 1.0923 1.0662
irintensity: 1.3562 4.9795 2.7108 8.8489 3.6045 0.2564 10.2632 0.9207 3.1963 5.8797 6.2649 5.2681 1.3768 47.8903 79.7154 8.9194 14.2219 9.3651 4.8492 14.0318 17.0840 46.7476 36.9378 17.2704 19.4592 29.5202 124.3196 3.2140 27.7042 53.5631 20.2263 17.8689 85.5070 139.3151 284.3802 119.2957 13.1079 25.8707 5.0543 42.8189 66.9557 17.2014 123.9024 248.3698 94.1436 45.0031 67.7449 26.5019 12.9335 3.3517 72.2332
temp: 298.150 k
press: 1.00000 atm
elementType: 17 17 8 8 8 6 6 6 6 6 6 6 6 1 1 1 1 1 1
symmnumber: 1
zpe: 321922.8 jmol-1
zpe.correction: 0.122614 hartree
zpe.thermalcorrener: 0.135856 hartree
zpe.thermalcorrenthalpy: 0.136801 hartree
zpe.thermalcorrgfe: 0.081944 hartree
zpe.sumelectzpe: -1453.242327 hartree
zpe.sumelectthermal: -1453.229084 hartree
zpe.sumelectthermalent: -1453.228140 hartree
zpe.sumelectthermalfe: -1453.282997 hartree
dipole: -4.3234 -4.4045 1.0837
dipole: 6.2662
quadrupole: -98.9212 -75.4829 -89.1847
quadrupole: -0.1306 -5.8156 0.7038
quadrupole: -11.0583 12.3800 -1.3217 -0.1306 -5.8156 0.7038
hfenergy: -1453.3649406 hartree
pointgroup: C01 [X(C8H6Cl2O3)]
dipole: -2.0537655 -1.1243217 0.771836 debye
dipolederiv: -0.050494 0.0395268 -0.0008106 0.1443484 -0.6671525 0.0919021 -0.0103062 0.0787832 -0.0351605 -0.4286699 0.3632844 -0.029446 0.3431181 -0.3531361 0.0291345 -0.0353586 0.0380333 -0.0247384 -1.4986685 0.3527078 0.2442083 0.330313 -0.3293523 -0.1178069 0.0256593 0.0045 -0.3386771 -1.1183811 -0.6625708 0.0782714 -0.6736111 -0.5913615 0.0431803 0.099686 0.0356667 -0.3979717 -1.1680784 -0.2861901 0.0843993 0.0824882 -0.3094791 -0.0003035 0.0150208 0.0087437 -0.3102946 0.9668567 -0.4577144 -0.0296211 -0.8634454 -0.295952 0.2039098 0.2354233 0.0378464 -0.002034 -0.9369268 -0.2505909 0.0893654 -0.3286263 -0.7753944 0.1412049 0.1033435 0.1465861 0.0594068 0.3475802 0.2282759 -0.0314213 -0.2312938 1.0332488 -0.1761999 0.0595574 -0.2025442 -0.0925815 1.0152858 0.5055846 -0.0502123 0.6957363 0.6986453 -0.1067846 -0.1469571 -0.0628092 0.0840847 0.8122071 -0.4550378 0.0320397 -0.1550091 0.7052667 -0.1038754 -0.0074724 -0.1051111 -0.0473162 -0.6698375 0.0003949 0.013781 0.1090202 -0.0915363 -0.0120295 -0.0013186 -0.0026253 -0.1372044 1.5397622 0.4872716 -0.1357577 0.3840505 0.7210573 -0.123079 -0.1083351 -0.1098306 0.1418622 0.7463774 -0.1260242 -0.1980913 0.0925085 0.1836836 0.0443289 -0.3619791 0.116308 0.447876 0.063971 -0.0268439 0.0076764 -0.030923 -0.0464358 0.0290332 0.0124776 0.0315955 0.1732562 0.0731902 0.0767898 -0.0129111 -0.0333759 -0.1412487 0.0453244 0.0041289 0.0383685 0.105667 -0.0158958 -0.0387923 -0.0867484 -0.0381501 0.0588965 -0.0692586 0.088666 -0.1033519 -0.1380998 0.0689803 -0.0329851 0.0343022 -0.1445936 -0.0373406 0.0481504 0.067406 0.0000033 0.0533941 -0.0660152 0.096875 -0.0042349 0.1406537 0.0337374 0.0288513 -0.0270477 0.044765 0.0696085 0.3187564 0.1860386 -0.004789 0.1767914 0.2038538 0.0043178 -0.0125938 0.0050725 0.3889229 unknown
polarizability: 173.9198701|-5.6291009|141.7276497|-8.7436715|-10.9125735|52.0873211 unknown
InChI: InChI=1S/C8H6Cl2O3/c1-13-8-6(12)2-5(9)4(3-11)7(8)10/h2-3,12H,1H3
charge 0 multiplicity 1
19 atoms
Cl -0.089285 2.768597 -0.471919
Cl 2.821139 -2.059118 0.109109
O  -2.384057 0.980565 -0.245651
O  -2.352135 -1.806377 0.200323
O  3.737413 0.721116 -0.336872
C  -1.191458 0.28319 -0.086231
C  1.317844 0.331991 -0.19073
C  0.036858 0.968886 -0.227706
C  -1.134021 -1.131125 0.101191
C  1.301143 -1.076414 0.018607
C  0.106483 -1.798401 0.165611
C  2.555426 1.150894 -0.364851
C  -3.389637 0.89213 0.84228
H  0.14719 -2.883025 0.316202
H  2.351095 2.230631 -0.535208
H  -2.958597 1.270967 1.787572
H  -3.745951 -0.143181 0.964237
H  -4.207855 1.548222 0.51213
H  -2.216896 -2.78505 0.260706
