program: Gaussian 09
title: 000086315
version: EM64L-G09RevD.01
frameworkgroup: C1[X(C14H11ClFNO4)]
method: RPBEPBE
basis: SDD
operation: Freq
keyword: #p
keyword: freq=noraman
keyword: PBEPBE/SDD
title: #p freq=noraman PBEPBE/SDD
converged: YES YES NO NO
title: Mulliken charges:
elementType: Cl F O O O O N C C C C C C C C C C C C C C H H H H H H H H H H H
charge: -0.039612 -0.165792 -0.266953 -0.279207 -0.423525 -0.192738 -0.023388 -0.069310 0.380772 0.382595 -0.380692 -0.325406 -0.712828 -0.285865 -0.409260 0.170947 0.064586 0.212826 -0.216332 -0.033561 -0.342785 0.245280 0.255411 0.266132 0.251719 0.244715 0.222510 0.264467 0.258365 0.292171 0.271052 0.383707
chargesum: 0.00000
title: Mulliken charges with hydrogens summed into heavy atoms:
elementType: Cl F O O O O N C C C C C C C C C C C C C C
charge: -0.039612 -0.165792 -0.266953 -0.279207 -0.039819 -0.192738 -0.023388 0.175970 0.380772 0.382595 -0.125280 -0.059274 0.006116 -0.021398 -0.150895 0.170947 0.064586 0.212826 0.075839 -0.033561 -0.071733
polarizability: 3.10114007e+02 -6.67950519e+00 1.66965735e+02 5.75295574e+00 -9.44171200e+00 1.05857858e+02
1716.lowfreq: -3.3013 -0.0015 -0.0014 -0.0013 3.9911 6.6011 12.3739 25.2704 29.5576
frequency: 11.6799 25.2526 29.5325 36.5030 46.2753 75.3194 94.7323 124.2691 144.3655 182.8193 195.2544 213.7172 221.8024 225.7882 258.3301 275.5664 312.6483 340.8936 356.0052 382.1454 394.7775 417.4349 456.2708 475.2168 490.9890 500.1229 519.3685 568.7309 590.3123 605.9139 617.7319 626.9172 647.9414 693.8897 714.0532 719.5426 730.2286 769.1535 785.1231 808.9761 829.8369 833.8998 869.2373 887.6708 890.7231 922.0171 937.7207 951.6706 1000.1219 1020.1425 1033.5045 1073.4216 1086.6262 1115.1757 1121.0143 1136.9664 1158.9804 1179.1691 1213.6699 1239.1704 1240.2785 1266.0974 1299.6847 1326.2267 1334.5407 1346.2966 1378.3999 1386.3361 1390.0477 1419.6385 1425.4833 1461.8661 1473.9322 1487.0472 1546.7324 1573.0409 1592.1500 1621.4051 1682.8591 3004.1367 3020.5256 3107.1166 3118.3509 3157.1741 3165.9998 3166.5055 3176.2574 3189.0960 3196.7783 3507.8467
redmass: 8.0136 8.0535 10.1463 7.0441 7.2982 5.2999 5.6764 6.3813 6.6295 7.1979 7.0807 1.8786 4.4586 2.0265 5.4191 4.9370 6.4000 6.6878 6.7242 7.4129 8.2949 3.0254 4.6446 5.0930 5.0910 4.7455 3.8460 4.5509 3.7445 6.2671 2.0536 3.2551 5.8959 4.6763 4.4260 4.8824 5.7800 3.6199 3.7820 1.2642 1.9536 4.5612 1.4383 1.3839 8.2681 3.1057 1.3625 1.3527 2.8245 2.6559 2.4084 2.1089 1.9203 1.6850 2.7524 2.2134 2.0639 1.5698 3.5275 1.5638 1.6469 4.6194 1.3384 1.2868 7.4577 1.5636 5.9569 3.1519 1.2508 3.6770 3.5994 1.0454 1.0543 2.4563 9.0821 7.7947 7.0860 7.0193 8.8450 1.0348 1.0853 1.0999 1.1016 1.0881 1.0929 1.0906 1.0967 1.0943 1.0960 1.0641
irintensity: 0.5374 0.7003 1.0700 0.2606 0.3712 0.1199 0.2185 1.0134 2.2056 0.8684 0.9514 1.6771 2.7982 0.0051 1.0867 3.5649 0.4582 0.3986 8.4379 0.1921 2.5299 0.0846 0.1270 7.6075 4.8586 21.9386 20.1882 8.1621 37.5712 1.1707 82.0437 30.6996 35.9751 11.0125 23.4028 21.0537 14.2785 5.6084 18.6982 0.1416 59.1582 95.2990 32.3194 8.3662 13.4408 46.7010 0.8632 2.4715 46.9991 297.6876 34.7906 25.7204 67.6671 14.7890 104.4037 0.4526 141.2062 323.5450 148.7689 1.3461 8.1249 222.6384 13.8392 0.6388 11.1469 16.8326 3.9896 22.1125 29.7809 66.7139 590.3700 13.9468 12.1409 300.1191 23.3388 28.2777 9.9091 13.0440 177.1162 13.7917 16.8128 17.4410 12.8583 8.4085 9.0641 3.3662 2.0434 1.4809 2.3778 27.4051
temp: 298.150 k
press: 1.00000 atm
elementType: 17 9 8 8 8 8 7 6 6 6 6 6 6 6 6 6 6 6 6 6 6 1 1 1 1 1 1 1 1 1 1 1
symmnumber: 1
zpe: 587654.6 jmol-1
zpe.correction: 0.223826 hartree
zpe.thermalcorrener: 0.243312 hartree
zpe.thermalcorrenthalpy: 0.244257 hartree
zpe.thermalcorrgfe: 0.171972 hartree
zpe.sumelectzpe: -1454.100877 hartree
zpe.sumelectthermal: -1454.081390 hartree
zpe.sumelectthermalent: -1454.080446 hartree
zpe.sumelectthermalfe: -1454.152730 hartree
dipole: -1.5440 -0.2980 -2.1097
dipole: 2.6312
quadrupole: -108.8395 -123.2924 -131.0809
quadrupole: -2.4955 13.8181 -4.1620
quadrupole: 12.2314 -2.2215 -10.0099 -2.4955 13.8181 -4.1620
hfenergy: -1454.3247024 hartree
pointgroup: C01[X(C14H11Cl1F1N1O4)]
dipole: 0.6232116 -0.7859781 0.2559242 debye
polarizability: 310.1669829|1.6139957|110.1013728|7.8053401|18.3527571|162.6692444 unknown
InChI: InChI=1S/C14H11ClFNO4/c1-8(14(18)19)20-10-2-4-11(5-3-10)21-13-12(16)6-9(15)7-17-13/h2-8,18H,1H3
charge 0 multiplicity 1
32 atoms
Cl -7.016203 -1.020988 -1.10021
F  -3.877905 1.349319 2.324013
O  3.418996 -0.386432 -1.352137
O  -1.638414 0.490457 0.98801
O  5.334919 -0.166462 1.655336
O  5.19457 1.530713 0.065891
N  -2.980926 -0.610053 -0.662906
C  4.568045 -0.805929 -0.541681
C  2.177503 -0.19879 -0.706796
C  -0.395731 0.198903 0.337557
C  1.121109 0.204996 -1.558423
C  1.946602 -0.395381 0.676455
C  5.679648 -1.162725 -1.537378
C  -0.170253 0.410742 -1.041479
C  0.647921 -0.192251 1.194202
C  5.038547 0.336579 0.376995
C  -2.866337 0.137682 0.453138
C  -4.017584 0.578319 1.16793
C  -5.296525 0.237014 0.716206
C  -5.386832 -0.547462 -0.457372
C  -4.217502 -0.954984 -1.124622
H  4.302242 -1.678192 0.08462
H  1.331781 0.357335 -2.62074
H  2.747027 -0.694175 1.359185
H  5.927717 -0.283776 -2.154971
H  5.334322 -1.976813 -2.195674
H  6.585884 -1.497002 -1.002845
H  -0.984582 0.71464 -1.701327
H  0.442027 -0.327336 2.259907
H  -6.182167 0.571985 1.261632
H  -4.257921 -1.563094 -2.032646
H  5.694221 0.564361 2.229228
