program: Gaussian 09
title: 000086254
version: EM64L-G09RevD.01
frameworkgroup: C1[X(C6H9Cl3O)]
method: RPBEPBE
basis: SDD
operation: Freq
keyword: #p
keyword: freq=noraman
keyword: PBEPBE/SDD
title: #p freq=noraman PBEPBE/SDD
converged: YES YES NO NO
title: Mulliken charges:
elementType: Cl Cl Cl O C C C C C C H H H H H H H H H
charge: -0.047872 -0.034122 -0.028868 -0.146336 -0.143870 0.364633 -0.466782 -0.589343 -0.631751 -0.640293 0.297178 0.300931 0.297042 0.254256 0.231223 0.253157 0.225582 0.263770 0.241463
chargesum: 0.00000
title: Mulliken charges with hydrogens summed into heavy atoms:
elementType: Cl Cl Cl O C C C C C C
charge: -0.047872 -0.034122 -0.028868 -0.146336 -0.143870 0.364633 -0.169604 0.008630 0.106885 0.090523
polarizability: 8.97292314e+01 -1.07894877e+00 1.11973764e+02 -2.53818533e+00 6.88676064e+00 8.30341027e+01
1716.lowfreq: -10.4087 -5.9664 -0.0034 -0.0032 -0.0017 8.1804 39.9081 55.1858 81.0737
frequency: 39.8215 55.1518 81.0572 143.7408 156.2162 166.0623 214.7716 227.6936 240.2340 255.5971 274.2593 316.0518 333.7031 344.3198 431.0922 508.8351 575.5258 599.6918 674.1692 718.6324 753.6014 880.2257 914.0338 979.8249 1018.1623 1050.7239 1064.4387 1090.0001 1120.9484 1210.9630 1213.8520 1264.3577 1272.7999 1332.8673 1392.3271 1396.8240 1442.7941 1456.3853 1458.2801 1462.9937 1464.2548 1623.7039 2994.7298 3012.4706 3072.4775 3090.7370 3100.1374 3110.7799 3128.9445 3131.2691 3159.7280
redmass: 6.4939 10.1621 9.0682 7.4725 9.8485 4.2467 2.7538 1.2134 1.2005 3.4064 3.2612 4.7548 4.4309 3.1141 5.2225 4.0011 5.6850 4.3631 6.3003 4.0422 3.7379 2.6620 1.6896 1.8074 1.9422 1.5705 1.5232 1.4149 1.9222 1.3553 3.5535 1.2669 1.6743 1.6729 1.2090 1.1953 1.0796 1.0506 1.0421 1.0627 1.0505 10.3855 1.0384 1.0359 1.0565 1.0940 1.0900 1.0992 1.1006 1.1008 1.1116
irintensity: 1.3924 2.0144 2.7846 3.0679 3.9849 5.7109 1.6925 0.7555 0.5817 0.2099 1.1346 5.9621 13.4955 1.1873 16.1781 13.0665 22.4702 18.6031 30.6418 7.0740 4.2225 4.2115 14.0231 23.4406 39.0380 42.5450 18.2793 0.1554 12.4388 11.3570 8.8448 3.9980 1.1405 13.4451 24.2647 30.6567 11.5844 11.3631 11.0800 20.7453 14.6407 76.9820 8.7870 3.8932 4.7696 7.8861 6.0423 6.7051 6.9848 7.6724 2.7997
temp: 298.150 k
press: 1.00000 atm
elementType: 17 17 17 8 6 6 6 6 6 6 1 1 1 1 1 1 1 1 1
symmnumber: 1
zpe: 364994.2 jmol-1
zpe.correction: 0.139019 hartree
zpe.thermalcorrener: 0.151403 hartree
zpe.thermalcorrenthalpy: 0.152347 hartree
zpe.thermalcorrgfe: 0.099230 hartree
zpe.sumelectzpe: -1688.645543 hartree
zpe.sumelectthermal: -1688.633159 hartree
zpe.sumelectthermalent: -1688.632215 hartree
zpe.sumelectthermalfe: -1688.685333 hartree
dipole: -0.4594 -2.0185 -1.7302
dipole: 2.6980
quadrupole: -75.9237 -86.8240 -83.4120
quadrupole: -2.1422 -1.9868 -0.5268
quadrupole: 6.1295 -4.7707 -1.3588 -2.1422 -1.9868 -0.5268
hfenergy: -1688.7845621 hartree
pointgroup: C01 [X(C6H9Cl3O1)]
dipole: -0.255341 0.7134673 0.7432885 debye
dipolederiv: -0.3249056 0.0006189 0.0131267 -0.0475342 -0.5387614 -0.253742 -0.0035307 -0.1895893 -0.4156622 -0.2920508 0.0851849 -0.0537559 0.0265758 -0.524793 0.0669812 -0.0261498 0.0517789 -0.1707521 -0.1760451 -0.1019266 -0.0235902 -0.0955997 -0.4936691 -0.1006025 -0.0358951 -0.1185767 -0.209252 -0.5811165 0.025609 0.0760145 -0.000983 -0.2297864 0.1111368 0.0086564 0.1572851 -0.7179424 0.096912 0.0591244 0.1700347 0.0856936 0.5739888 0.2433153 0.1156251 0.1551347 0.392085 1.0015684 -0.24706 -0.1250254 -0.1584589 -0.0036677 -0.1836553 0.0017797 -0.2515054 0.7120192 0.03418 0.0915642 -0.0716493 0.0280552 0.6708237 0.0364689 -0.0887465 0.0189212 0.0803341 0.0847978 0.1129563 0.0440531 0.1353039 0.5547402 0.204128 0.0562599 0.20416 0.149893 -0.0916175 0.0342929 -0.0863929 -0.0108824 -0.0867376 -0.0224648 -0.0753688 0.0052545 -0.151209 -0.0965888 -0.0380417 0.02547 -0.0555148 -0.1168192 0.025387 -0.0293765 0.0238993 0.0053747 0.0523328 0.0174917 0.0765916 0.003886 -0.0196977 -0.0154871 0.0505512 0.0215694 -0.0235741 0.0710557 0.0168145 -0.0991683 0.0073954 -0.0153149 -0.0380133 -0.0955403 -0.0108365 0.0124223 -0.036481 -0.0186277 0.0532792 0.0022539 0.0047144 -0.0689666 0.0361473 -0.04458 0.0566516 0.0974805 -0.0638641 0.0168168 -0.0294755 -0.0217804 0.0758074 0.00899 0.0610554 0.0774346 -0.0892216 0.0103781 0.0411429 0.013677 0.1113805 0.0142045 0.0861684 -0.0103672 0.0540208 0.107148 0.0094778 -0.0092776 0.0156891 0.0254304 -0.075018 -0.0150419 -0.0765381 0.0448114 0.0789415 0.0289789 0.0241748 0.0289672 -0.0996985 -0.015643 0.0209299 -0.0083118 0.1104465 0.1028424 -0.0230087 0.0159975 0.0139473 0.1047856 -0.0449619 0.0811063 -0.0240542 -0.0303305 -0.0392323 0.0000372 -0.0878422 0.037004 0.1048623 0.0411255 -0.0965646 0.0353005 0.0232291 unknown
polarizability: 89.4283735|-0.6466114|110.3472783|2.4781211|9.7125546|84.9614465 unknown
InChI: InChI=1S/C6H9Cl3O/c1-4(8)5(10)6(2,9)3-7/h4H,3H2,1-2H3
charge 0 multiplicity 1
19 atoms
Cl -1.124082 1.864464 1.32991
Cl 1.894577 -1.689601 0.574725
Cl -1.738023 -2.363626 -0.130921
O  0.611491 0.558247 -1.653194
C  -1.1168 0.372743 0.05331
C  0.356675 0.369223 -0.441413
C  1.486983 0.187722 0.59054
C  -1.515446 -0.820313 0.933632
C  -2.113069 0.722303 -1.046015
C  2.745943 0.973508 0.247033
H  1.139919 0.367093 1.617933
H  -0.752114 -1.083556 1.678121
H  -2.490149 -0.64084 1.408745
H  -1.833604 1.666189 -1.538083
H  -3.130355 0.81022 -0.63028
H  -2.104698 -0.07441 -1.809565
H  2.535797 2.057262 0.326998
H  3.066565 0.759658 -0.784821
H  3.560691 0.722213 0.945144
